Peptide,PTM,ModifiedAA,ModifiedPosition,PeptideUniqueToGene,ExperimentDesc,ExpID,PubmedID,ScoreType,IdentScore,LocProb,Log2FChange,PQ-val,QuantSig,PEP,MassErrorPPM
ASSSDDVDDEDLSFLED,nt,A,26,true,"HUNTER N-terminome: legumain, GluC and trypsin",119,31951383,"MaxQuant score",107.8300000,,,,,,
ASSSDDVDDEDLSFLE,nt,A,26,true,"HUNTER N-terminome: legumain, GluC and trypsin",119,31951383,"MaxQuant score",138.2500000,,,,,,
ASSSDDVDDE,nt,A,26,true,"Arg/N-end rule seed, prt6 vs. Wt",99,29168982,"MASCOT Score",80.5800000,,-0.0276163,0.7494995,NO,2.0970000491616E-7,-1.4756536
NPDSDPLPTPE,nt,N,89,true,"Arg/N-end rule seed, prt6 vs. Wt",99,29168982,"MASCOT Score",55.0200000,,0.0511161,0.6830285,NO,7.5949998290525E-7,-0.6549289
DVVVIKER,ac,K,109,true,"Quantitative Acetylproteomics",101,29440448,,,,,,,,
KIGPGVYNLTTLDDAEKVLTSGNK,ng,N,213,true,"N-Glycopeptide Profiling in Arabidopsis Infloresce",132,27067053,"MOWSE score",21.8000000,,,,,0.014999999664724,
IGPGVYNLTTLDDAEKVLTSGNK,ng,N,213,true,"N-glycan occupancy Arabidopsis glycoproteins",87,23994444,"Ladder score",68.9000000,,,,,,
KKIGPGVYNLTTLDDAEK,ng,N,213,true,"N-Glycopeptide Profiling in Arabidopsis Infloresce",132,27067053,"MOWSE score",33.1000000,,,,,0.00028000000747852,
KIGPGVYNLTTLDDAEK,ng,N,213,true,"Conserved N-glycosylation",74,22633491,"MaxQuant Score",151.6400000,1.0000000,,,,2.005000051497E-29,0.6550000
KIGPGVYNLTTLDDAEK,ng,N,213,true,"N-Glycopeptide Profiling in Arabidopsis Infloresce",132,27067053,"MOWSE score",26.6000000,,,,,0.001700000022538,
KIGPGVYNLTTLDDAEK,ng,N,213,true,"UDP-GlcNAc transporter glycopeptide analysis",135,30224661,,,,,,,1.7707503018526E-16,0.8000000
IGPGVYNLTTLDDAEK,ng,N,213,true,"N-glycan occupancy Arabidopsis glycoproteins",87,23994444,"Ladder score",83.9000000,,,,,,
IGPGVYNLTTLDDAEK,ng,N,213,true,"N-Glycopeptide Profiling in Arabidopsis Infloresce",132,27067053,"MOWSE score",37.3000000,,,,,3.6999999792897E-6,
IGPGVYNLTTLDDAEK,ng,N,213,true,"N-linked Glycan Micro-heterogeneity Arabidopsis",134,29237727,,,,,,,,
IGPGVYNLTTLDDAEK,ng,N,213,true,"UDP-GlcNAc transporter glycopeptide analysis",135,30224661,,,,,,,3.6637665670933E-18,0.9000000
SKRPALVLVKKEEE,nt,S,276,true,"Arabidopsis translation initiation landscape - NT",167b,35069635,,,,,,,,
KQLLLFVTKNESEK,ng,N,342,true,"N-Glycopeptide Profiling in Arabidopsis Infloresce",132,27067053,"MOWSE score",50.2000000,,,,,1.7999999499807E-6,
QLLLFVTKNESEK,ng,N,342,true,"Conserved N-glycosylation",74,22633491,"MaxQuant Score",141.0500000,1.0000000,,,,6.6349998702211E-20,0.3770000
QLLLFVTKNESEK,ng,N,342,true,"N-glycan occupancy Arabidopsis glycoproteins",87,23994444,"Ladder score",58.7000000,,,,,,
QLLLFVTKNESEK,ng,N,342,true,"N-Glycopeptide Profiling in Arabidopsis Infloresce",132,27067053,"MOWSE score",25.8000000,,,,,0.016000000759959,
QLLLFVTKNESEK,ng,N,342,true,"N-linked Glycan Micro-heterogeneity Arabidopsis",134,29237727,,,,,,,,
QLLLFVTKNESEK,ng,N,342,true,"UDP-GlcNAc transporter glycopeptide analysis",135,30224661,,,,,,,2.8604117772307E-12,0.9000000
VLTEFQEAAKSFK,ac,K,356,true,"Quantitative Acetylproteomics",101,29440448,,,,,,,,
MDGTTNEHPKAK,ac,K,508,true,"Quantitative Acetylproteomics",101,29440448,,,,,,,,
AKAEGFPTILFFPAGNKTSEPITVDTDR,ng,N,524,true,"N-Glycopeptide Profiling in Arabidopsis Infloresce",132,27067053,"MOWSE score",36.5000000,,,,,0.00063999998383224,
AEGFPTILFFPAGNKTSEPITVDTDR,ng,N,524,true,"N-Glycopeptide Profiling in Arabidopsis Infloresce",132,27067053,"MOWSE score",29.1000000,,,,,0.017000000923872,
AKAEGFPTILFFPAGNK,ng,N,524,true,"Conserved N-glycosylation",74,22633491,"MaxQuant Score",151.1400000,1.0000000,,,,3.2049999650243E-28,-0.5370000
AKAEGFPTILFFPAGNK,ng,N,524,true,"UDP-GlcNAc transporter glycopeptide analysis",135,30224661,,,,,,,1.9656168248616E-8,3.3000000
AEGFPTILFFPAGNK,ng,N,524,true,"N-Glycopeptide Profiling in Arabidopsis Infloresce",132,27067053,"MOWSE score",32.1000000,,,,,0.00036000000545755,
AEGFPTILFFPAGNK,ng,N,524,true,"ER-associatied N-glycan degradation chilling stres",133,27558752,,,,,,,,
AEGFPTILFFPAGNK,ng,N,524,true,"N-linked Glycan Micro-heterogeneity Arabidopsis",134,29237727,,,,,,,,
AEGFPTILFFPAGNK,ng,N,524,true,"UDP-GlcNAc transporter glycopeptide analysis",135,30224661,,,,,,,4.0662653739723E-17,1.1000000
LEKPASTESPK,ph,S,560,true,"LAXIC - mannitol vs control",84b,23660473,XCorr,2.3900000,0.9350000,,,,0.14474000036716,
LEKPASTESPK,ph,S,563,true,"LAXIC - mannitol vs control",84b,23660473,XCorr,2.3900000,0.9990000,,,,0.14474000036716,
ESPDSTTKSSQSDSKDEL,ac,K,587,true,"Quantitative Acetylproteomics",101,29440448,,,,,,,,
