Peptide,PTM,ModifiedAA,ModifiedPosition,PeptideUniqueToGene,ExperimentDesc,ExpID,PubmedID,ScoreType,IdentScore,LocProb,Log2FChange,PQ-val,QuantSig,PEP,MassErrorPPM
GQVSSDTSNLK,ph,S,91,true,"atm and atr DNA damage response",88,25561503,"MASCOT Score",27.0000000,0.9930000,,,,,0.0700000
GQVSSDTSNLK,ph,S,92,true,"atm and atr DNA damage response",88,25561503,"MASCOT Score",39.0000000,0.8930000,,,,,-0.4300000
GQVSSDTSNLK,ph,S,92,true,"Tissue atlas Arabidopsis - ProteomicsDB",114,32188942,"MaxQuant score",113.9900000,0.9990660,,,,3.3431901101721E-5,
GQVSSDTSNLK,ph,T,94,true,"Tissue atlas Arabidopsis - ProteomicsDB",114,32188942,"MaxQuant score",110.8000000,0.8742580,,,,9.1706097009592E-5,
GQVSSDTSNLK,ph,S,95,true,"atm and atr DNA damage response",88,25561503,"MASCOT Score",25.0000000,0.9970000,,,,,0.4200000
GQVSSDTSNLK,ph,S,95,true,"Tissue atlas Arabidopsis - ProteomicsDB",114,32188942,"MaxQuant score",113.8200000,0.9000260,,,,3.074060077779E-5,
GQVSSDTSNLKVKGEPEDPFQPEIK,sumo,K,100,true,"SUMO Ligase SIZ1 heat stress",4,29588388,,,,,,,,
CIGGGGGDDNADSDSDIEVVADFFGVNLR,ph,S,346,true,"srk2dei ABA signaling phopshoproteomics",83,23572148,"MASCOT Score",57.0000000,,,,,,-0.0021000
CIGGGGGDDNADSDSDIEVVADFFGVNLR,ph,S,348,true,"srk2dei ABA signaling phopshoproteomics",83,23572148,"MASCOT Score",57.0000000,,,,,,-0.0021000
KMEMLPVKQEGYSDGPAPLK,sumo,K,488,true,"SUMO Ligase SIZ1 heat stress",4,29588388,,,,,,,,
QEGYSDGPAPLK,ph,S,493,true,"srk2dei ABA signaling phopshoproteomics",83,23572148,"MASCOT Score",41.0000000,,,,,,0.0005000
QEGYSDGPAPLK,ph,S,493,true,"atm and atr DNA damage response",88,25561503,"MASCOT Score",72.0000000,0.9980000,,,,,0.5200000
QEGYSDGPAPLK,ph,S,493,true,"TOR Kinase and ABA Receptor",100,29290610,XCorr,3.4594171,0.9878000,,,,4.9740001486498E-6,
QEGYSDGPAPLK,ph,S,493,true,"Col-0 callus - FC Col-0 vs. Col-0 Xray",111a,31410901,,39.0500000,,-0.6333541,0.0000000,NO,,-0.9772626
QEGYSDGPAPLK,ph,S,493,true,"Col-0 X-ray callus - FC Col-0 vs. Col-0 Xray",111b,31410901,,39.0500000,,-0.6333541,0.0000000,NO,,-0.9772626
QEGYSDGPAPLK,ph,S,493,true,"atm callus - FC atm vs. atm Xray",111c,31410901,,39.0500000,,-0.9959925,0.0000000,NO,,-0.9772626
QEGYSDGPAPLK,ph,S,493,true,"atm-3 X-ray callus - FC atm vs. atm Xray",111d,31410901,,39.0500000,,-0.9959925,0.0000000,NO,,-0.9772626
QEGYSDGPAPLK,ph,S,493,true,"Tissue atlas Arabidopsis - ProteomicsDB",114,32188942,"MaxQuant score",208.8300000,1.0000000,,,,0,
NGIWEVSKPNTNGLSSSNR,ph,S,522,true,"Tissue atlas Arabidopsis - ProteomicsDB",114,32188942,"MaxQuant score",156.2200000,0.8530970,,,,3.1913301439222E-33,
NIIPMSSSATGSGR,ph,S,547,true,"Tissue atlas Arabidopsis - ProteomicsDB",114,32188942,"MaxQuant score",113.4700000,0.8999780,,,,5.0105500122299E-5,
SEANDGLVDNPLAFGR,ph,S,735,true,"Tissue atlas Arabidopsis - ProteomicsDB",114,32188942,"MaxQuant score",104.4400000,1.0000000,,,,2.5433100745431E-6,
LGDSASGNHGDPATTNGINSSHQMSTR,ph,S,794,true,"Tissue atlas Arabidopsis - ProteomicsDB",114,32188942,"MaxQuant score",85.8490000,0.8549520,,,,1.2168499672453E-15,
LGDSASGNHGDPATTNGINSSHQMSTR,ph,S,796,true,"Tissue atlas Arabidopsis - ProteomicsDB",114,32188942,"MaxQuant score",147.5100000,0.9999040,,,,0,
LGDSASGNHGDPATTNGINSSHQMSTR,ng,N,809,true,"ER-associatied N-glycan degradation chilling stres",133,27558752,,,,,,,,
EGSMDTTTETASLLLGMNDSR,ph,S,820,true,"SnRK2 protein kinase substrates",85,23776212,XCorr,3.8582518,1.0000000,,,,0.00019351500668563,
EGSMDTTTETASLLLGMNDSR,ph,S,820,true,"Phospho cell culture sucrose/TOR",109,30833711,,,0.9999730,,,,,
EGSMDTTTETASLLLGMNDSR,ph,S,820,true,"Tissue atlas Arabidopsis - ProteomicsDB",114,32188942,"MaxQuant score",181.4000000,1.0000000,,,,8.4077907859489E-45,
EGSMDTTTETASLLLGMNDSR,ph,T,823,true,"atm and atr DNA damage response",88,25561503,"MASCOT Score",43.0000000,0.8980000,,,,,0.0500000
SDNPFSFPR,ph,S,852,true,"Tissue atlas Arabidopsis - ProteomicsDB",114,32188942,"MaxQuant score",89.3560000,1.0000000,,,,0.0024866899475455,
MYLSIDSDSE,ph,S,870,true,"srk2dei ABA signaling phopshoproteomics",83,23572148,"MASCOT Score",28.0000000,,,,,,0.0008000
MYLSIDSDSE,ph,S,870,true,"SnRK2 protein kinase substrates",85,23776212,XCorr,2.1798012,1.0000000,,,,3.8385998777812E-5,
MYLSIDSDSE,ph,S,870,true,"atm and atr DNA damage response",88,25561503,"MASCOT Score",61.0000000,1.0000000,,,,,1.1400000
MYLSIDSDSE,ph,S,872,true,"atm and atr DNA damage response",88,25561503,"MASCOT Score",61.0000000,1.0000000,,,,,1.1400000
