Peptide,PTM,ModifiedAA,ModifiedPosition,PeptideUniqueToGene,ExperimentDesc,ExpID,PubmedID,ScoreType,IdentScore,LocProb,Log2FChange,PQ-val,QuantSig,PEP,MassErrorPPM
ANIGFDESNPIR,nt,A,22,true,"Arg/N-end rule pathway Roots",80,25728785,"MASCOT Score",41.9400000,,,,,0.00026070000603795,
ANIGFDESNPIR,nt,A,22,true,"N-terminal ChaFRADIC",92,26010716,"MASCOT Score",38.9000000,,,,,1.8100000431787E-7,
ANIGFDESNPIR,nt,A,22,true,"FtsH12 N-terminome: WT / FtsH12 knockdown miRNA",118,33216923,"MaxQuant score",119.1700000,,,,,0,
ANIGFDESNPIR,nt,A,22,true,"HUNTER N-terminome: legumain, GluC and trypsin",119,31951383,"MaxQuant score",82.1710000,,,,,,
ANIGFDESNPIR,nt,A,22,true,"Arabidopsis translation initiation landscape - NT",167b,35069635,,,,,,,,
ANIGFDE,nt,A,22,true,"N-terminal ChaFRADIC",92,26010716,"MASCOT Score",43.8100000,,,,,0.027879999950528,
TKLGAAQNCSATLK,ng,N,125,true,"Conserved N-glycosylation",74,22633491,"MaxQuant Score",162.9600000,1.0000000,,,,2.34199994248E-17,-0.4220000
LGAAQNCSATLK,ng,N,125,false,"Conserved N-glycosylation",74,22633491,"MaxQuant Score",162.9600000,1.0000000,,,,2.34199994248E-17,-0.4320000
EAALPETKDWRED,nt,E,138,true,"HUNTER N-terminome: legumain, GluC and trypsin",119,31951383,"MaxQuant score",73.9100000,,,,,,
EAALPETKDWR,nt,E,138,true,"Arg/N-end rule pathway Roots",80,25728785,"MASCOT Score",35.6500000,,,,,0.047389999032021,
EAALPETKDWR,nt,E,138,true,"FtsH12 N-terminome: WT / FtsH12 knockdown miRNA",118,33216923,"MaxQuant score",63.0620000,,,,,0.010766999796033,
EAALPETKDWR,nt,E,138,true,"HUNTER N-terminome: legumain, GluC and trypsin",119,31951383,"MaxQuant score",95.4770000,,,,,,
EAALPETK,nt,E,138,true,"N-terminal ChaFRADIC",92,26010716,"MASCOT Score",20.9000000,,,,,0.00015649999841116,
AALPETKDWRED,nt,A,139,true,"HUNTER N-terminome: legumain, GluC and trypsin",119,31951383,"MaxQuant score",74.9870000,,,,,,
AALPETKDWR,nt,A,139,true,"FtsH12 N-terminome: WT / FtsH12 knockdown miRNA",118,33216923,"MaxQuant score",74.6980000,,,,,0.049343999475241,
AALPETKDWR,nt,A,139,true,"HUNTER N-terminome: legumain, GluC and trypsin",119,31951383,"MaxQuant score",112.1300000,,,,,,
QGGCGSCWTFSTTGALE,nt,Q,159,true,"HUNTER N-terminome: legumain, GluC and trypsin",119,31951383,"MaxQuant score",116.2400000,,,,,,
WTFSTTGALE,nt,W,166,false,"Arg/N-end rule seed, prt6 vs. Wt",99,29168982,"MASCOT Score",52.5500000,,-1.0955457,0.0612366,NO,0.00032640001154505,-2.2394852
NGGLPSQAFE,nt,N,206,true,"Arg/N-end rule seed, prt6 vs. Wt",99,29168982,"MASCOT Score",42.7700000,,-0.8066891,0.0016522,NO,0.0083640003576875,-2.1297852
GGLPSQAFE,nt,G,207,false,"Arg/N-end rule seed, prt6 vs. Wt",99,29168982,"MASCOT Score",45.6400000,,-0.7373896,0.0512999,NO,0.0053929998539388,-1.4097078
AYPYTGKDETCK,ox,C,238,true,"OxiTRAQ Arabidopsis - 5 mM H2O2 versus control",47,24376095,,,,-0.3423363,0.0768776,NO,,
FSAENVGVQVLNSVNITLGAEDELK,ng,N,254,true,"Conserved N-glycosylation",74,22633491,"MaxQuant Score",278.0800000,0.8720000,,,,0,1.5550000
FSAENVGVQVLNSVNITLGAEDELK,ng,N,254,true,"N-glycan occupancy Arabidopsis glycoproteins",87,23994444,"Ladder score",54.4000000,,,,,,
FSAENVGVQVLNSVNITLGAEDELK,ng,N,254,true,"ER-associatied N-glycan degradation chilling stres",133,27558752,,,,,,,,
NMCGIATCASYPVVA,sno,C,351,true,"hot5-4 / wildtype, FAT-switch S-nitrosoproteome",169,37277371,,,,,,,,
