Peptide,PTM,ModifiedAA,ModifiedPosition,PeptideUniqueToGene,ExperimentDesc,ExpID,PubmedID,ScoreType,IdentScore,LocProb,Log2FChange,PQ-val,QuantSig,PEP,MassErrorPPM
VPSTNATSVPR,ph,S,278,true,"Tissue atlas Arabidopsis - ProteomicsDB",114,32188942,"MaxQuant score",116.2400000,0.9788800,,,,2.8607100830413E-5,
VPSTNATSVPRYSPPSGSGSSSR,ph,S,288,true,"TOR Kinase and ABA Receptor",100,29290610,XCorr,4.2366986,0.8475000,,,,4.4200000957062E-6,
YSPPSGSGSSSR,ph,S,288,true,"atm and atr DNA damage response",88,25561503,"MASCOT Score",32.0000000,0.8980000,,,,,0.0200000
YSPPSGSGSSSR,ph,S,288,true,"Tissue atlas Arabidopsis - ProteomicsDB",114,32188942,"MaxQuant score",180.8800000,0.9998020,,,,0,
YSPPSGSGSSSR,fuc,S,291,true,"SPINDLY O-fucosylation",162,36739885,,,,,,,-0.8299999833107,
STALPAAASWGTHQSLATSVTSNGSSDIQR,fuc,S,317,true,"SPINDLY O-fucosylation",162,36739885,,,,,,,-0.25,
ITAPDRDPTSNRLSSSVDSAYGGR,ph,S,405,true,"Tissue atlas Arabidopsis - ProteomicsDB",114,32188942,"MaxQuant score",49.9680000,0.7693980,,,,0.00024691299768165,
LSSSVDSAYGGR,ph,S,406,true,"Tissue atlas Arabidopsis - ProteomicsDB",114,32188942,"MaxQuant score",100.3800000,0.7751670,,,,9.9702299749538E-9,
LSSSVDSAYGGR,ph,S,407,true,"atm and atr DNA damage response",88,25561503,"MASCOT Score",45.0000000,0.9990000,,,,,-0.4600000
LSSSVDSAYGGR,ph,S,407,true,"Tissue atlas Arabidopsis - ProteomicsDB",114,32188942,"MaxQuant score",131.6900000,0.9499760,,,,9.9702299749538E-9,
LSSSVDSAYGGR,ph,S,410,true,"atm and atr DNA damage response",88,25561503,"MASCOT Score",45.0000000,1.0000000,,,,,-0.4600000
LSSSVDSAYGGR,ph,S,410,true,"Tissue atlas Arabidopsis - ProteomicsDB",114,32188942,"MaxQuant score",92.1510000,0.9995900,,,,0.00024989200755954,
LLSNLSSSSLDTNHMASR,ph,S,574,true,"TOR Kinase and ABA Receptor",100,29290610,XCorr,4.7249289,0.8793000,,,,3.1020001188153E-5,
LLSNLSSSSLDTNHMASR,ph,S,574,true,"Phospho cell culture sucrose/TOR",109,30833711,,,0.7750930,,,,,
LLSNLSSSSLDTNHMASR,ph,S,574,true,"Tissue atlas Arabidopsis - ProteomicsDB",114,32188942,"MaxQuant score",338.9400000,0.9996880,,,,0,
LLSNLSSSSLDTNHMASR,ph,S,577,true,"Tissue atlas Arabidopsis - ProteomicsDB",114,32188942,"MaxQuant score",185.5900000,0.8458560,,,,9.0278798402336E-36,
SMSSVEHSLFANEGR,ph,S,611,true,"Tissue atlas Arabidopsis - ProteomicsDB",114,32188942,"MaxQuant score",163.8000000,0.9510800,,,,7.7199401385397E-13,
QQSLSSAQQVNGFHHDLR,ph,S,868,true,"Tissue atlas Arabidopsis - ProteomicsDB",114,32188942,"MaxQuant score",123.1400000,0.9999880,,,,2.8833201424312E-14,
NLSPSLNDPYGFSSR,ph,S,886,true,"TOR Kinase and ABA Receptor",100,29290610,XCorr,4.1394062,1.0000000,,,,1.5510000594077E-5,
NLSPSLNDPYGFSSR,ph,S,886,true,"Phospho cell culture sucrose/TOR",109,30833711,,,0.9997770,,,,,
NLSPSLNDPYGFSSR,ph,S,886,true,"Tissue atlas Arabidopsis - ProteomicsDB",114,32188942,"MaxQuant score",240.5000000,0.9999990,,,,0,
LMDQTQGSSLSPFSQLPR,ph,S,909,true,"Tissue atlas Arabidopsis - ProteomicsDB",114,32188942,"MaxQuant score",228.4900000,0.9961410,,,,0,
FRIPSPGDVYNR,ph,S,974,true,"TOR Kinase and ABA Receptor",100,29290610,XCorr,2.9548469,1.0000000,,,,0.00020470000163186,
FRIPSPGDVYNR,ph,S,974,true,"Tissue atlas Arabidopsis - ProteomicsDB",114,32188942,"MaxQuant score",84.5080000,0.9999990,,,,0.00017301700427197,
