Peptide,PTM,ModifiedAA,ModifiedPosition,PeptideUniqueToGene,ExperimentDesc,ExpID,PubmedID,ScoreType,IdentScore,LocProb,Log2FChange,PQ-val,QuantSig,PEP,MassErrorPPM
MDKSSLVSDFLSFLNASPTAFHAVDESKR,nta,M,1,true,"Arabidopsis translation initiation landscape - NTA",167a,35069635,,,,,,,,
MDKSSLVSDFL,nta,M,1,true,"Arg/N-end rule pathway Roots",80,25728785,"MASCOT Score",36.3000000,,,,,0.085320003330708,
MDKSSLVSDF,nta,M,1,true,"N-term acetylation drought responses",5,26184543,,,,,,,,
MDKSSLVSD,nta,M,1,true,"Arg/N-end rule seed, prt6 vs. Wt",99,29168982,"MASCOT Score",38.2500000,,-0.3602985,0.1004827,NO,0.0089720003306866,0.7075128
KSSLVSDFLSF,nt,K,3,true,"Arabidopsis translation initiation landscape - NT",167b,35069635,,,,,,,,
LLKAGYEQISER,ub,K,33,true,"upl3 mutant / wildtype",168,35926874,"MaxQuant score",107.1700000,1.0000000,0.0989585,,,3.5400000342634E-5,0.6297700
LKPVSKITK,ac,K,96,true,"Quantitative Acetylproteomics",101,29440448,,,,,,,,
TPAESGEHDEGKK,ph,S,198,true,"atm and atr DNA damage response",88,25561503,"MASCOT Score",45.0000000,1.0000000,,,,,0.2100000
TPAESGEHDEGKK,ph,S,198,true,"Tissue atlas Arabidopsis - ProteomicsDB",114,32188942,"MaxQuant score",122.9600000,1.0000000,,,,5.8501897770569E-10,
TPAESGEHDEGKK,ac,K,205,true,"Quantitative Acetylproteomics",101,29440448,,,,,,,,
CAETSSK,sno,C,207,true,"hot5-4 / wildtype, FAT-switch S-nitrosoproteome",169,37277371,,,,,,,,
TSSKSKHHPLLME,nt,T,210,true,"Arabidopsis translation initiation landscape - NT",167b,35069635,,,,,,,,
ALIDATSSGSDLEDESGIR,ph,S,282,true,"Tissue atlas Arabidopsis - ProteomicsDB",114,32188942,"MaxQuant score",250.1000000,0.9001150,,,,0,
ALIDATSSGSDLEDESGIR,ph,S,284,true,"Tyrosine phosphorylation in Arabidopsis",59,18463617,"MASCOT Score",51.0000000,,,,,,-1.5881919
ALIDATSSGSDLEDESGIR,ph,S,284,true,"Phospho cell culture sucrose/TOR",109,30833711,,,0.9989860,,,,,
ALIDATSSGSDLEDESGIR,ph,S,284,true,"Tissue atlas Arabidopsis - ProteomicsDB",114,32188942,"MaxQuant score",301.7700000,0.9998630,,,,0,
NDMGCGSTIGPILASSVGIR,sno,C,414,true,"Site-specific nitrosomeproteomic id - gsnor1-3",90b,25699590,XCorr,3.3100000,,,,,0.00020540000696201,-7.4800000
