Peptide,PTM,ModifiedAA,ModifiedPosition,PeptideUniqueToGene,ExperimentDesc,ExpID,PubmedID,ScoreType,IdentScore,LocProb,Log2FChange,PQ-val,QuantSig,PEP,MassErrorPPM
VVSAEPISLSK,ph,S,15,true,"Tissue atlas Arabidopsis - ProteomicsDB",114,32188942,"MaxQuant score",115.3700000,0.8680880,,,,2.936949931609E-5,
EIKSKETKPSSDR,ub,K,64,true,"Arabidopsis ubiquitination COFRADIC",40,26744219,"MaxQuant Score",57.0340000,0.9910000,,,,0.00029930000891909,0.6870000
ETKSTETKQSSDAKSER,ub,K,77,true,"Arabidopsis ubiquitination COFRADIC",40,26744219,"MaxQuant Score",55.6880000,0.9740000,,,,4.1879999912453E-7,0.3160000
SERNVIDEFDGRK,ph,S,84,true,"Phosphorylation Early Elicitor Signaling",23,17317660,,,,,,,,
SERNVIDEFDGR,ph,S,84,true,"Phosphorylation Early Elicitor Signaling",23,17317660,,,,,,,,
NSEAVSVESVYGR,ph,S,106,true,"Tissue atlas Arabidopsis - ProteomicsDB",114,32188942,"MaxQuant score",122.1200000,0.9999430,,,,6.5261796407867E-5,
VNEKLEAEQRSEER,ph,S,143,true,"Tissue atlas Arabidopsis - ProteomicsDB",114,32188942,"MaxQuant score",99.7960000,1.0000000,,,,2.8986600227654E-5,
LEAEQRSEERR,ph,S,143,true,"TOR Kinase and ABA Receptor",100,29290610,XCorr,2.6881733,1.0000000,,,,0.0030879999976605,
LEAEQRSEER,ph,S,143,true,"atm and atr DNA damage response",88,25561503,"MASCOT Score",52.0000000,1.0000000,,,,,0.4300000
LEDEQKSADRK,ph,S,179,true,"Tissue atlas Arabidopsis - ProteomicsDB",114,32188942,"MaxQuant score",59.7090000,1.0000000,,,,0.0030777100473642,
EKLEDEQKSAEIK,ph,S,211,true,"Tissue atlas Arabidopsis - ProteomicsDB",114,32188942,"MaxQuant score",176.8500000,1.0000000,,,,1.9055799476054E-16,
KSDEEIVSEER,ub,K,252,true,"Arabidopsis ubiquitination COFRADIC",40,26744219,"MaxQuant Score",92.1120000,1.0000000,,,,8.2020000263583E-5,-0.1360000
RKSDEEIVSEER,ph,S,253,true,"Phospho cell culture sucrose/TOR",109,30833711,,,1.0000000,,,,,
RKSDEEIVSEER,ph,S,253,true,"Tissue atlas Arabidopsis - ProteomicsDB",114,32188942,"MaxQuant score",72.5830000,0.9999990,,,,0.00099553295876831,
SDEEIVSEER,ph,S,259,true,"Tissue atlas Arabidopsis - ProteomicsDB",114,32188942,"MaxQuant score",129.3400000,1.0000000,,,,2.8433099942049E-5,
