Peptide,PTM,ModifiedAA,ModifiedPosition,PeptideUniqueToGene,ExperimentDesc,ExpID,PubmedID,ScoreType,IdentScore,LocProb,Log2FChange,PQ-val,QuantSig,PEP,MassErrorPPM
STGLDMSLDDMIAKNR,nt,S,2,true,"N-terminal ChaFRADIC",92,26010716,"MASCOT Score",42.8600000,,,,,1.5149999853747E-5,
STGLDMSLDDMIAKNR,nt,S,2,true,"Arg/N-end rule seed, prt6 vs. Wt",99,29168982,"MASCOT Score",64.9900000,,,,,0.00020730000687763,-0.8043019
STGLDMSLDDMIAKNR,nt,S,2,true,"FtsH12 N-terminome: WT / FtsH12 knockdown miRNA",118,33216923,"MaxQuant score",69.3830000,,,,,0.070247001945972,
STGLDMSLDDMIAKNR,nta,S,2,true,"Arg/N-end rule pathway Roots",80,25728785,"MASCOT Score",98.5700000,,,,,1.3049999836312E-7,
STGLDMSLDDMIAKNR,nta,S,2,true,"N-terminal ChaFRADIC",92,26010716,"MASCOT Score",42.8600000,,,,,1.5149999853747E-5,
STGLDMSLDDMIAKNR,nta,S,2,true,"Arg/N-end rule seed, prt6 vs. Wt",99,29168982,"MASCOT Score",64.9900000,,-0.1593990,0.1280479,NO,0.00020730000687763,-0.8043019
STGLDMSLDDMIAKNR,nta,S,2,true,"FtsH12 N-terminome: WT / FtsH12 knockdown miRNA",118,33216923,"MaxQuant score",55.3700000,,,,,0.03396699950099,
STGLDMSLDDMIAKNR,nta,S,2,true,"HUNTER N-terminome: legumain, GluC and trypsin",119,31951383,"MaxQuant score",41.9120000,,,,,,
STGLDMSLDDMIAKNR,nta,S,2,true,"Arabidopsis translation initiation landscape - NTA",167a,35069635,,,,,,,,
STGLDMSLDDMIAKN,nta,S,2,true,"HUNTER N-terminome: legumain, GluC and trypsin",119,31951383,"MaxQuant score",93.2580000,,,,,,
STGLDMSLDDMIAK,nta,S,2,true,"Characterization plant N-terminal acetylation",6,22223895,"MASCOT Score",56.1500000,,,,,,
STGLDMSLDDMIAK,ph,S,8,true,"atm and atr DNA damage response",88,25561503,"MASCOT Score",25.0000000,0.9650000,,,,,-0.4500000
STGLDMSLDDMIAKNR,ub,K,15,true,"Arabidopsis ubiquitination COFRADIC",40,26744219,"MaxQuant Score",72.8980000,1.0000000,,,,5.0600000633949E-8,0.1310000
SSAGIETGTK,ph,S,81,true,"atm and atr DNA damage response",88,25561503,"MASCOT Score",71.0000000,0.9980000,,,,,-1.4500000
ELFAEVGELKR,ac,K,115,true,"Quantitative Acetylproteomics",101,29440448,,,,,,,,
SKGTAEVVYSR,nt,S,127,true,"Arabidopsis translation initiation landscape - NT",167b,35069635,,,,,,,,
SKGTAEVVYSR,ub,K,128,true,"Arabidopsis ubiquitination COFRADIC",40,26744219,"MaxQuant Score",193.8100000,1.0000000,,,,0,0.4850000
RGDALAAVKK,ac,K,146,true,"Quantitative Acetylproteomics",101,29440448,,,,,,,,
GPAEKISAEDLDADLDK,ph,S,225,true,"Tissue atlas Arabidopsis - ProteomicsDB",114,32188942,"MaxQuant score",144.5700000,1.0000000,,,,6.5413200030229E-12,
ISAEDLDADLDKYHSGDMETN,ph,S,238,true,"Tissue atlas Arabidopsis - ProteomicsDB",114,32188942,"MaxQuant score",147.8600000,0.9972890,,,,1.2282799719968E-25,
ISAEDLDADLDKYHSGDMETN,ph,T,243,true,"Tissue atlas Arabidopsis - ProteomicsDB",114,32188942,"MaxQuant score",169.7000000,0.9994500,,,,2.3841899239987E-36,
