Peptide,PTM,ModifiedAA,ModifiedPosition,PeptideUniqueToGene,ExperimentDesc,ExpID,PubmedID,ScoreType,IdentScore,LocProb,Log2FChange,PQ-val,QuantSig,PEP,MassErrorPPM
MESTGKVKKAFGGR,nta,M,1,true,"Arg/N-end rule pathway Roots",80,25728785,"MASCOT Score",54.3000000,,,,,0.0001304000033997,
MESTGKVKKAFGGR,nta,M,1,true,"FtsH12 N-terminome: WT / FtsH12 knockdown miRNA",118,33216923,"MaxQuant score",42.3470000,,,,,0.0035159999970347,
MESTGKVKKAFGGR,nta,M,1,true,"HUNTER N-terminome: legumain, GluC and trypsin",119,31951383,"MaxQuant score",78.7630000,,,,,,
MESTGKVKKA,nta,M,1,true,"N-term acetylation drought responses",5,26184543,,,,,,,,
MESTGKVK,ac,K,6,true,"Quantitative Acetylproteomics",101,29440448,,,,,,,,
MESTGKVK,hib,K,6,true,"Histone Khib and acetylation, dark-induced starvat",137,34165567,,,1.0000000,,,,,
MESTGKVKKAFGGR,ub,K,6,true,"Arabidopsis ubiquitination COFRADIC",40,26744219,"MaxQuant Score",63.1850000,0.9940000,,,,0.00043019998702221,0.1270000
MESTGKVKKAFGGR,ub,K,9,true,"Arabidopsis ubiquitination COFRADIC",40,26744219,"MaxQuant Score",57.4340000,0.8430000,,,,0.0020000000949949,-0.3500000
SVSKSMK,ac,K,27,true,"Quantitative Acetylproteomics",101,29440448,,,,,,,,
SVSKSMK,hib,K,27,true,"Histone Khib and acetylation, dark-induced starvat",137,34165567,,,1.0000000,,,,,
SMKAGLQFPVGR,hib,K,30,true,"Histone Khib and acetylation, dark-induced starvat",137,34165567,,,1.0000000,,,,,
AAEVLELAGNAAR,nt,A,69,false,"Metacaspase9 substrates - Col-0 / mc9",51a,23964026,"MASCOT Score",70.0000000,,1.0806794,,NO,,-1.1784287
NDEELGKLLSGVTIAHGGVLPNINSVLLPK,hib,K,105,true,"Histone Khib and acetylation, dark-induced starvat",137,34165567,,,1.0000000,,,,,
KSATKPAEEK,ph,S,130,true,"atm and atr DNA damage response",88,25561503,"MASCOT Score",26.0000000,1.0000000,,,,,-4.9200000
KSATKPAEEK,ph,S,130,true,"Protein sumoylation and phosphorylation cross-talk",97,28419593,,,,,,,,
KSATKPAEEK,ph,S,130,true,"Tissue atlas Arabidopsis - ProteomicsDB",114,32188942,"MaxQuant score",63.8000000,0.8604600,,,,0.0035866899415851,
SATKPAEEK,ph,S,130,true,"atm and atr DNA damage response",88,25561503,"MASCOT Score",33.0000000,0.9940000,,,,,2.1000000
KSATKPAEEKATK,ac,K,138,true,"Histone deacetylases- hda14 vs WT (low light)",98c,29061669,"MaxQuant Score",98.6800000,1.0000000,0.4660000,0.9931160,NO,0.00065000000176951,
SATKPAEEKATK,ac,K,138,true,"Histone deacetylases - apicidin vs control",98a,29061669,"MaxQuant Score",55.3000000,0.9550000,-0.0500000,0.8356030,NO,0.0049999998882413,
KSATKPAEEKATK,hib,K,138,true,"Histone Khib and acetylation, dark-induced starvat",137,34165567,,,0.9981150,,,,,
ATKSPVKSPK,ac,K,141,true,"Histone deacetylases - apicidin vs control",98a,29061669,"MaxQuant Score",93.8000000,1.0000000,-0.3680000,0.1815516,NO,7.0000000960135E-6,
ATKSPVKSPK,ac,K,141,true,"Histone deacetylases- hda14 vs WT (low light)",98c,29061669,"MaxQuant Score",72.5000000,1.0000000,0.2550000,0.9885531,NO,0.0080000003799796,
ATKSPVKSPK,ac,K,141,true,"Quantitative Acetylproteomics",101,29440448,,,,,,,,
ATKSPVKSPK,ph,S,142,true,"atm and atr DNA damage response",88,25561503,"MASCOT Score",27.0000000,0.9990000,,,,,-4.1200000
ATKSPVKSPK,ac,K,145,true,"Histone deacetylases - apicidin vs control",98a,29061669,"MaxQuant Score",93.8000000,1.0000000,-0.3680000,0.1815516,NO,7.0000000960135E-6,
ATKSPVKSPK,ac,K,145,true,"Histone deacetylases- hda14 vs WT (low light)",98c,29061669,"MaxQuant Score",72.5000000,1.0000000,0.2550000,0.9885531,NO,0.0080000003799796,
ATKSPVKSPK,ac,K,145,true,"Quantitative Acetylproteomics",101,29440448,,,,,,,,
SPVKSPK,ac,K,145,true,"Quantitative Acetylproteomics",101,29440448,,,,,,,,
ATKSPVKSPK,ph,S,146,true,"STN8 phosphoproteome",38,21768351,"MASCOT Score",46.4900000,,,,,,0.0966694
ATKSPVKSPK,ph,S,146,true,"Chloroplast kinase substrates",60,19376835,"MASCOT Score",46.4100000,,,,,,-0.0279302
ATKSPVKSPK,ph,S,146,true,"atm and atr DNA damage response",88,25561503,"MASCOT Score",27.0000000,1.0000000,,,,,-4.1200000
SPVKSPK,ph,S,146,true,"Chloroplast kinase substrates",60,19376835,"MASCOT Score",31.1500000,,,,,,-1.1991200
SPVKSPK,ph,S,146,true,"SnRK2 protein kinase substrates",85,23776212,XCorr,2.2893679,0.9990000,,,,0.015306999906898,
SPVKSPK,ph,S,146,true,"Protein sumoylation and phosphorylation cross-talk",97,28419593,,,,,,,,
SPVKSPK,ph,S,146,true,"Col-0 callus - FC Col-0 vs. Col-0 Xray",111a,31410901,,33.1000000,,-0.0398597,0.0000000,NO,,0.1187107
SPVKSPK,ph,S,146,true,"Col-0 X-ray callus - FC Col-0 vs. Col-0 Xray",111b,31410901,,33.1000000,,-0.0398597,0.0000000,NO,,0.1187107
SPVKSPK,ph,S,146,true,"atm callus - FC atm vs. atm Xray",111c,31410901,,33.1000000,,-1.1346473,0.0000000,NO,,0.1187107
SPVKSPK,ph,S,146,true,"atm-3 X-ray callus - FC atm vs. atm Xray",111d,31410901,,33.1000000,,-1.1346473,0.0000000,NO,,0.1187107
