Peptide,PTM,ModifiedAA,ModifiedPosition,PeptideUniqueToGene,ExperimentDesc,ExpID,PubmedID,ScoreType,IdentScore,LocProb,Log2FChange,PQ-val,QuantSig,PEP,MassErrorPPM
VRISVLNDALKSMYNAEKR,nt,V,2,false,"Arg/N-end rule pathway Roots",80,25728785,"MASCOT Score",60.6000000,,,,,1.7899999704696E-8,
VRISVLNDALKSMYNAEKR,nt,V,2,false,"Stromal N-terminome",96,26371235,"MASCOT Score",47.9800000,,,,,,
VRISVLNDALKSMYNAEKR,nt,V,2,false,"HUNTER N-terminome: legumain, GluC and trypsin",119,31951383,"MaxQuant score",78.3540000,,,,,,
VRISVLNDALKSMYNAEK,nt,V,2,false,"Arg/N-end rule pathway Roots",80,25728785,"MASCOT Score",25.4500000,,,,,0.020169999450445,
VRISVLNDALKSMYNAE,nt,V,2,false,"HUNTER N-terminome: legumain, GluC and trypsin",119,31951383,"MaxQuant score",63.9180000,,,,,,
VRISVLNDALKSMYNAE,nt,V,2,false,"Arabidopsis translation initiation landscape - NT",167b,35069635,,,,,,,,
VRISVLNDALKSMY,nt,V,2,false,"Arg/N-end rule pathway Roots",80,25728785,"MASCOT Score",65.9400000,,,,,1.0939999839366E-7,
VRISVLNDALKS,nt,V,2,false,"N-terminal ChaFRADIC",92,26010716,"MASCOT Score",22.3600000,,,,,5.7990000641439E-6,
VRISVLNDALK,nt,V,2,false,"Arg/N-end rule pathway Roots",80,25728785,"MASCOT Score",51.7700000,,,,,4.0320001062355E-6,
ISVLNDALKSMYNAEKR,nt,I,4,false,"Arabidopsis translation initiation landscape - NT",167b,35069635,,,,,,,,
VRISVLNDALK,ph,S,5,false,"Tissue atlas Arabidopsis - ProteomicsDB",114,32188942,"MaxQuant score",70.6280000,1.0000000,,,,0.0054612797684968,
SMYNAEKR,nt,S,13,false,"Arabidopsis translation initiation landscape - NT",167b,35069635,,,,,,,,
SMYNAEKR,ac,K,19,false,"Quantitative Acetylproteomics",101,29440448,,,,,,,,
GYIGEFEYVDDHR,nt,G,45,false,"FtsH12 N-terminome: WT / FtsH12 knockdown miRNA",118,33216923,"MaxQuant score",66.2620000,,-0.6425264,0.0373487,YES,0.014829000458121,
SGKIVVELNGR,nt,S,58,false,"Arabidopsis translation initiation landscape - NT",167b,35069635,,,,,,,,
LNKCGVISPR,ub,K,71,false,"upl3 mutant / wildtype",168,35926874,"MaxQuant score",54.4860000,1.0000000,-2.0409718,,,0.0039695999585092,-0.6010700
CGVISPR,acy,C,72,false,"Arabidopsis S-acylation atlas - Meristem",163a,35681017,,,,,,,,
CGVISPR,acy,C,72,false,"Arabidopsis S-acylation atlas - Hypocotyl",163b,35681017,,,,,,,,
CGVISPR,ox,C,72,false,"OxiTRAQ Arabidopsis - 5 mM H2O2 versus control",47,24376095,,,,-0.5020971,0.0141390,YES,,
CGVISPR,sno,C,72,false,"hot5-4 / wildtype, FAT-switch S-nitrosoproteome",169,37277371,,,,,,,,
CGVISPR,so,C,72,false,"S-sulfenylation site detection using YAP1C",110,32714340,,,,,,,,
FDVGVKEIEGWTAR,ub,K,84,false,"upl3 mutant / wildtype",168,35926874,"MaxQuant score",66.2460000,1.0000000,,,,0.000313268013997,-0.3567000
QFGYIVLTTSAGIMDHEEAR,nt,Q,98,false,"HUNTER N-terminome: legumain, GluC and trypsin",119,31951383,"MaxQuant score",66.7970000,,,,,,
TSAGIMDHEEARRKNVGGKVL,nt,T,106,false,"Arabidopsis translation initiation landscape - NT",167b,35069635,,,,,,,,
