Peptide,PTM,ModifiedAA,ModifiedPosition,PeptideUniqueToGene,ExperimentDesc,ExpID,PubmedID,ScoreType,IdentScore,LocProb,Log2FChange,PQ-val,QuantSig,PEP,MassErrorPPM
SCLLLR,sno,C,30,false,"hot5-4 / wildtype, FAT-switch S-nitrosoproteome",169,37277371,,,,,,,,
SCLLLR,so,C,30,false,"S-sulfenylation site detection using YAP1C",110,32714340,,,,,,,,
TIELDGKR,ac,K,62,false,"Quantitative Acetylproteomics",101,29440448,,,,,,,,
IKLQIWDTAGQER,ub,K,65,false,"upl3 mutant / wildtype",168,35926874,"MaxQuant score",66.9890000,1.0000000,0.1335635,,,0.00041832000715658,-0.2893100
FRTITTAYYR,ph,T,79,false,"Tissue atlas Arabidopsis - ProteomicsDB",114,32188942,"MaxQuant score",74.7800000,0.9969940,,,,0.0043550902046263,
QHASDNVNKILVGNKADMDE,nt,Q,115,false,"HUNTER N-terminome: legumain, GluC and trypsin",119,31951383,"MaxQuant score",110.3800000,,,,,,
NIEQHASDNVNKILVGNK,ub,K,123,false,"upl3 mutant / wildtype",168,35926874,"MaxQuant score",64.4540000,1.0000000,0.2448871,,,0.00011629299842753,-1.6172000
ILVGNKADMDESKR,ac,K,129,false,"Quantitative Acetylproteomics",101,29440448,,,,,,,,
ILVGNKADMDESK,ac,K,129,false,"Quantitative Acetylproteomics",101,29440448,,,,,,,,
ADMDESKR,ac,K,136,false,"Quantitative Acetylproteomics",101,29440448,,,,,,,,
ILVGNKADMDESKR,ub,K,136,false,"Ubiquitination Membrane Proteins",120,33585938,,,,,,,,
GQALADEYGIKFFETSAK,ub,K,154,false,"upl3 mutant / wildtype",168,35926874,"MaxQuant score",68.2430000,1.0000000,-0.1046974,0.8771800,NO,6.6752596467268E-5,0.7361700
TNLNVEEVFFSIAKDIK,ub,K,175,false,"upl3 mutant / wildtype",168,35926874,"MaxQuant score",123.1400000,1.0000000,1.3425547,,,5.746160214315E-10,-1.4547000
LADTDSRAEPATIK,ph,S,186,true,"Tissue atlas Arabidopsis - ProteomicsDB",114,32188942,"MaxQuant score",136.3900000,0.9912130,,,,3.5023298551096E-5,
AEPATIKISQTDQAAGAGQATQK,ub,K,194,false,"upl3 mutant / wildtype",168,35926874,"MaxQuant score",86.7610000,1.0000000,0.9014945,0.3894800,NO,2.5871299769165E-8,0.8600800
ISQTDQAAGAGQATQK,ph,S,196,false,"Tissue atlas Arabidopsis - ProteomicsDB",114,32188942,"MaxQuant score",210.0600000,0.9984070,,,,0,
ISQTDQAAGAGQATQK,ph,T,198,false,"Tissue atlas Arabidopsis - ProteomicsDB",114,32188942,"MaxQuant score",158.2700000,0.9999650,,,,3.0569600670272E-13,
