Peptide,PTM,ModifiedAA,ModifiedPosition,PeptideUniqueToGene,ExperimentDesc,ExpID,PubmedID,ScoreType,IdentScore,LocProb,Log2FChange,PQ-val,QuantSig,PEP,MassErrorPPM
VTPSNDTLSR,ng,N,216,true,"Conserved N-glycosylation",74,22633491,"MaxQuant Score",86.5970000,1.0000000,,,,0.0040000001899898,-1.1360000
TGPEIDQTHVSTAVK,ph,S,640,true,"Large-scale phosphorylation discovery",44,23111157,XCorr,3.1930000,,,,,,
TGPEIDQTHVSTAVK,ph,S,640,true,"atm and atr DNA damage response",88,25561503,"MASCOT Score",48.0000000,0.9360000,,,,,-0.2300000
TGPEIDQTHVSTAVK,ph,T,641,true,"atm and atr DNA damage response",88,25561503,"MASCOT Score",53.0000000,0.9950000,,,,,0.0600000
GSFGYLDPEYFR,ph,S,646,false,"Plasmamembrane phosphorylation",20,15308754,,,,,,,,
GSFGYLDPEYFR,ph,S,646,false,"Pollen phosphoproteome Arabidopsis",43,22631563,"MASCOT Score",45.2500000,,,,,,
GSFGYLDPEYFR,ph,S,646,false,"Tyrosine phosphorylation in Arabidopsis",59,18463617,"MASCOT Score",29.0000000,,,,,,-0.9806349
GSFGYLDPEYFR,ph,S,646,false,"TOR Kinase and ABA Receptor",100,29290610,XCorr,3.2853138,0.9999000,,,,0.0030320000369102,
GSFGYLDPEYFR,ph,S,646,false,"Tissue atlas Arabidopsis - ProteomicsDB",114,32188942,"MaxQuant score",101.3900000,0.9999880,,,,0.00012155299918959,
VFSQLIKSEGR,ph,S,826,true,"Tissue atlas Arabidopsis - ProteomicsDB",114,32188942,"MaxQuant score",53.9950000,0.9997230,,,,0.0054091899655759,
