Peptide,PTM,ModifiedAA,ModifiedPosition,PeptideUniqueToGene,ExperimentDesc,ExpID,PubmedID,ScoreType,IdentScore,LocProb,Log2FChange,PQ-val,QuantSig,PEP,MassErrorPPM
GSPKKNENKGFF,nta,G,2,true,"Arabidopsis translation initiation landscape - NTA",167a,35069635,,,,,,,,
SVNGVQGNE,nt,S,30,true,"Arg/N-end rule seed, prt6 vs. Wt",99,29168982,"MASCOT Score",33.9000000,,-0.7579406,0.1222660,NO,0.025319999083877,-0.6341981
WNEKMSYQPCDAEGEPLPGTELK,ub,K,295,true,"upl3 mutant / wildtype",168,35926874,"MaxQuant score",69.4620000,1.0000000,,,,3.1849099286774E-6,-0.8275300
INSFDTAPAK,ph,S,339,true,"Tissue atlas Arabidopsis - ProteomicsDB",114,32188942,"MaxQuant score",88.3380000,0.9977040,,,,0.0015284300316125,
YSLEQGDLSK,ph,S,367,true,"Tissue atlas Arabidopsis - ProteomicsDB",114,32188942,"MaxQuant score",91.7840000,1.0000000,,,,0.0010420799953863,
AGSEKHSLEER,ac,K,373,true,"Quantitative Acetylproteomics",101,29440448,,,,,,,,
DTAESSSSASNETDLK,ph,S,431,true,"Tissue atlas Arabidopsis - ProteomicsDB",114,32188942,"MaxQuant score",235.7100000,0.9823150,,,,0,
DTAESSSSASNETDLK,ph,S,433,true,"Tissue atlas Arabidopsis - ProteomicsDB",114,32188942,"MaxQuant score",191.3700000,0.8534620,,,,2.9427267750821E-44,
DTAESSSSASNETDLK,ph,S,434,true,"Tissue atlas Arabidopsis - ProteomicsDB",114,32188942,"MaxQuant score",204.5200000,0.9591170,,,,0,
DTAESSSSASNETDLK,ph,S,436,true,"Tissue atlas Arabidopsis - ProteomicsDB",114,32188942,"MaxQuant score",96.2080000,0.9615580,,,,9.9913595477119E-6,
