Peptide,PTM,ModifiedAA,ModifiedPosition,PeptideUniqueToGene,ExperimentDesc,ExpID,PubmedID,ScoreType,IdentScore,LocProb,Log2FChange,PQ-val,QuantSig,PEP,MassErrorPPM
GVCSGGK,sno,C,168,false,"hot5-4 / wildtype, FAT-switch S-nitrosoproteome",169,37277371,,,,,,,,
GVCSGGKNFTCNNK,ng,N,173,false,"Conserved N-glycosylation",74,22633491,"MaxQuant Score",227.6500000,1.0000000,,,,1.4012984643248E-45,-1.3290000
DTSFFGIGNGTVR,ng,N,220,true,"Conserved N-glycosylation",74,22633491,"MaxQuant Score",150.1500000,1.0000000,,,,1.8529999250401E-20,0.4670000
GFITKVVLGNGK,ac,K,330,true,"Quantitative Acetylproteomics",101,29440448,,,,,,,,
SVNAFDMKGK,ac,K,350,true,"Quantitative Acetylproteomics",101,29440448,,,,,,,,
SAASSACDAK,sno,C,367,true,"hot5-4 / wildtype, FAT-switch S-nitrosoproteome",169,37277371,,,,,,,,
TAALCAPACLNK,sno,C,379,true,"hot5-4 / wildtype, FAT-switch S-nitrosoproteome",169,37277371,,,,,,,,
TAALCAPACLNK,ng,N,381,true,"Conserved N-glycosylation",74,22633491,"MaxQuant Score",60.1580000,1.0000000,,,,0.021999999880791,-0.3800000
ADHIAFLCGMNYTSK,ng,N,601,true,"Conserved N-glycosylation",74,22633491,"MaxQuant Score",91.9050000,1.0000000,,,,4.7410001570825E-5,-0.1780000
LSGTDSTFSVTFNR,ng,N,649,true,"Conserved N-glycosylation",74,22633491,"MaxQuant Score",142.5000000,1.0000000,,,,4.4599998584642E-20,0.2670000
TLTNVGTPNSTYK,ng,N,659,true,"Conserved N-glycosylation",74,22633491,"MaxQuant Score",127.6700000,1.0000000,,,,1.309999960071E-12,0.5450000
TLTNVGTPNSTYKSK,ac,K,663,true,"Quantitative Acetylproteomics",101,29440448,,,,,,,,
