Peptide,PTM,ModifiedAA,ModifiedPosition,PeptideUniqueToGene,ExperimentDesc,ExpID,PubmedID,ScoreType,IdentScore,LocProb,Log2FChange,PQ-val,QuantSig,PEP,MassErrorPPM
STHNEASDLDNGTDDLPSFTEFSFDQLR,ph,S,25,true,"Phosphorylation Early Elicitor Signaling",23,17317660,,,,,,,,
STHNEASDLDNGTDDLPSFTEFSFDQLR,ph,S,25,true,"TOR Kinase and ABA Receptor",100,29290610,XCorr,6.4904051,0.9799000,,,,3.9019999037437E-11,
STHNEASDLDNGTDDLPSFTEFSFDQLR,ph,S,36,true,"Conserved plant phosphoproteome - Arabidopsis",61a,20466843,"MASCOT Score",46.0000000,1.0000000,,,,,
AATCGFSTDSIVSEHGVK,acy,C,50,true,"Arabidopsis S-acylation atlas - Hypocotyl",163b,35681017,,,,,,,,
QFLEEAKAVGQLR,ub,K,101,false,"Ubiquitination Membrane Proteins",120,33585938,,,,,,,,
QFLEEAKAVGQLR,ub,K,101,false,"upl3 mutant / wildtype",168,35926874,"MaxQuant score",81.5650000,1.0000000,-0.2933589,,,0.00015471900405828,2.8725000
DGKSYSTNLAFTPPEYLR,ph,S,207,false,"Tissue atlas Arabidopsis - ProteomicsDB",114,32188942,"MaxQuant score",83.4180000,0.9995560,,,,0.00021839499822818,
DGKSYSTNLAFTPPEYLR,ph,Y,208,false,"Large-scale phosphorylation discovery",44,23111157,XCorr,3.2890000,,,,,,
SYSTNLAFTPPEYLR,ph,S,209,false,"Arabidopsis root NAA phosphoproteome",18a,27643528,"MaxQuant Score",87.6680000,0.8830000,,,,1.0880000012037E-8,0.2420000
SYSTNLAFTPPEYLR,ph,S,209,false,"Sucrose-induced phosphorylation",24,17586839,,,,,,,,
SYSTNLAFTPPEYLR,ph,S,209,false,"Plasmembrane Ph Immune Responses",25,17651370,,,,,,,,
SYSTNLAFTPPEYLR,ph,S,209,false,"Brassinosteroid-Regulated Phosphorylation Dynamics",94,26187819,"MaxQuant Score",150.2300000,0.9630000,,,,5.0109997531619E-13,0.8510000
SYSTNLAFTPPEYLR,ph,S,209,false,"Phospho cell culture sucrose/TOR",109,30833711,,,0.8286590,,,,,
SYSTNLAFTPPEYLR,ph,S,209,false,"Tissue atlas Arabidopsis - ProteomicsDB",114,32188942,"MaxQuant score",305.2900000,0.9997530,,,,0,
CLQYEAR,sno,C,288,false,"hot5-4 / wildtype, FAT-switch S-nitrosoproteome",169,37277371,,,,,,,,
ETDIPSHVLMGIPHGAASPK,ph,S,329,true,"SnRK2 protein kinase substrates",85,23776212,XCorr,2.7109699,0.9990000,,,,0.00011775999882957,
ETDIPSHVLMGIPHGAASPK,ph,S,329,true,"atm and atr DNA damage response",88,25561503,"MASCOT Score",81.0000000,1.0000000,,,,,-3.4000000
ETDIPSHVLMGIPHGAASPK,ph,S,329,true,"TOR Kinase and ABA Receptor",100,29290610,XCorr,4.3567319,1.0000000,,,,0.00030149999656714,
ETDIPSHVLMGIPHGAASPK,ph,S,329,true,"Tissue atlas Arabidopsis - ProteomicsDB",114,32188942,"MaxQuant score",288.9200000,1.0000000,,,,0,
ETTSLTPLGDACSR,sno,C,343,true,"hot5-4 / wildtype, FAT-switch S-nitrosoproteome",169,37277371,,,,,,,,
