Peptide,PTM,ModifiedAA,ModifiedPosition,PeptideUniqueToGene,ExperimentDesc,ExpID,PubmedID,ScoreType,IdentScore,LocProb,Log2FChange,PQ-val,QuantSig,PEP,MassErrorPPM
VRSYSVR,ph,S,59,true,"TOR Kinase and ABA Receptor",100,29290610,XCorr,2.8136823,0.9813000,,,,0.10360000282526,
SNHDDDDDDELLK,ph,S,82,true,"atm and atr DNA damage response",88,25561503,"MASCOT Score",34.0000000,1.0000000,,,,,-0.8600000
SNHDDDDDDELLK,ph,S,82,true,"Tissue atlas Arabidopsis - ProteomicsDB",114,32188942,"MaxQuant score",208.8500000,1.0000000,,,,4.6256694151546E-39,
KIPDSGNSLGR,ph,S,175,true,"Tissue atlas Arabidopsis - ProteomicsDB",114,32188942,"MaxQuant score",75.5890000,0.9145340,,,,0.001424920046702,
VSFDEPR,ph,S,195,true,"Tissue atlas Arabidopsis - ProteomicsDB",114,32188942,"MaxQuant score",117.6500000,1.0000000,,,,1.1254899618507E-5,
ASWDGCLIGK,ph,S,202,true,"Tissue atlas Arabidopsis - ProteomicsDB",114,32188942,"MaxQuant score",103.3400000,1.0000000,,,,0.00033932199585252,
LIPLSSVTEDVKASPEK,ph,S,228,true,"Large-scale phosphorylation discovery",44,23111157,XCorr,4.4720000,,,,,,
LIPLSSVTEDVKASPEK,ph,S,228,true,"Tissue atlas Arabidopsis - ProteomicsDB",114,32188942,"MaxQuant score",203.8200000,1.0000000,,,,0,
AISNAKVSPETVGLFHGAK,ph,S,287,true,"Tissue atlas Arabidopsis - ProteomicsDB",114,32188942,"MaxQuant score",169.4100000,0.9999340,,,,9.0265802691847E-29,
VSPETVGLFHGAK,ph,S,287,false,"atm and atr DNA damage response",88,25561503,"MASCOT Score",74.0000000,1.0000000,,,,,0.9300000
VSPETVGLFHGAK,ph,S,287,false,"Tissue atlas Arabidopsis - ProteomicsDB",114,32188942,"MaxQuant score",124.0900000,0.9998740,,,,1.7049600501196E-5,
GASIVNGFEGGR,ph,S,433,true,"Tissue atlas Arabidopsis - ProteomicsDB",114,32188942,"MaxQuant score",77.6440000,1.0000000,,,,0.0019098400371149,
SLCEDGMFHGVEGK,ph,S,462,true,"Tissue atlas Arabidopsis - ProteomicsDB",114,32188942,"MaxQuant score",174.5900000,1.0000000,,,,4.4674899918356E-16,
LGTYSPDNLR,ph,S,490,true,"Tissue atlas Arabidopsis - ProteomicsDB",114,32188942,"MaxQuant score",222.9200000,0.9999970,,,,0,
FYLTPLNSHMTSK,ph,T,504,true,"Tissue atlas Arabidopsis - ProteomicsDB",114,32188942,"MaxQuant score",133.2300000,0.9999990,,,,2.3710199457128E-5,
