Peptide,PTM,ModifiedAA,ModifiedPosition,PeptideUniqueToGene,ExperimentDesc,ExpID,PubmedID,ScoreType,IdentScore,LocProb,Log2FChange,PQ-val,QuantSig,PEP,MassErrorPPM
AYSHDWTECPFVHPGENAR,mar,D,227,false,"Noncanonical mono(ADP-ribosyl)ation of SZF protein",156,34592134,,,,,,,,
AYSHDWTECPFVHPGENAR,mar,E,230,false,"Noncanonical mono(ADP-ribosyl)ation of SZF protein",156,34592134,,,,,,,,
AYSHDWTECPFVHPGENAR,sno,C,231,false,"Site-specific nitrosomeproteomic id - gsnor1-3",90a,25699590,XCorr,2.6200000,,,,,0.18690000474453,-5.7700000
AYSHDWTECPFVHPGENAR,sno,C,231,false,"Site-specific nitrosomeproteomic id - gsnor1-3",90b,25699590,XCorr,3.2000000,,,,,0.00098889996297657,-2.7500000
VCFFAHKPEELRPLYPSTGSGVPSPR,ph,S,323,true,"TOR Kinase and ABA Receptor",100,29290610,XCorr,2.9955721,0.9995000,,,,0.0059239999391139,
VCFFAHKPEELRPLYPSTGSGVPSPR,ph,S,323,true,"Tissue atlas Arabidopsis - ProteomicsDB",114,32188942,"MaxQuant score",214.3900000,0.9998960,,,,0,
LAGGAMSPVNSLSDMFGTEDNTSGLQIR,ph,S,435,true,"TOR Kinase and ABA Receptor",100,29290610,XCorr,4.9852476,0.9666000,,,,1.2550000064948E-5,
LAGGAMSPVNSLSDMFGTEDNTSGLQIR,ph,S,435,true,"Tissue atlas Arabidopsis - ProteomicsDB",114,32188942,"MaxQuant score",51.9560000,0.9117580,,,,6.966960063437E-5,
SQSFIER,ph,S,502,true,"Protein sumoylation and phosphorylation cross-talk",97,28419593,,,,,,,,
SQSFIER,ph,S,502,true,"TOR Kinase and ABA Receptor",100,29290610,XCorr,2.5707316,0.9188000,,,,0.0055650002323091,
SQSFIER,ph,S,502,true,"Phospho cell culture sucrose/TOR",109,30833711,,,0.9999180,,,,,
SQSFIER,ph,S,502,true,"Col-0 callus - FC Col-0 vs. Col-0 Xray",111a,31410901,,35.0300000,,-0.4035280,0.0000000,NO,,-0.0381036
SQSFIER,ph,S,502,true,"Col-0 X-ray callus - FC Col-0 vs. Col-0 Xray",111b,31410901,,35.0300000,,-0.4035280,0.0000000,NO,,-0.0381036
SQSFIER,ph,S,502,true,"atm callus - FC atm vs. atm Xray",111c,31410901,,35.0300000,,-1.3724351,0.0000000,NO,,-0.0381036
SQSFIER,ph,S,502,true,"atm-3 X-ray callus - FC atm vs. atm Xray",111d,31410901,,35.0300000,,-1.3724351,0.0000000,NO,,-0.0381036
SQSFIER,ph,S,502,true,"Tissue atlas Arabidopsis - ProteomicsDB",114,32188942,"MaxQuant score",162.8000000,1.0000000,,,,0.0037027299404144,
