Peptide,PTM,ModifiedAA,ModifiedPosition,PeptideUniqueToGene,ExperimentDesc,ExpID,PubmedID,ScoreType,IdentScore,LocProb,Log2FChange,PQ-val,QuantSig,PEP,MassErrorPPM
ASTEPERENREDETEVNEDEDTGAQVAPIVR,nt,A,2,true,"Stromal N-terminome",96,26371235,"MASCOT Score",36.1700000,,,,,,
ASTEPERENREDETEVNEDEDTGAQVAPIVR,nta,A,2,true,"Stromal N-terminome",96,26371235,"MASCOT Score",36.1700000,,,,,,
ENREDETEVNEDEDTGAQVAPIVR,ph,T,15,true,"Tissue atlas Arabidopsis - ProteomicsDB",114,32188942,"MaxQuant score",232.8400000,1.0000000,,,,0,
FDKEGNQWKER,ub,K,66,true,"Arabidopsis ubiquitination COFRADIC",40,26744219,"MaxQuant Score",72.2900000,1.0000000,,,,0.00036750000435859,0.1830000
ICANHLISSGMSVQEHSGNEK,so,C,97,true,"Arabidopsis S-sulfenylation chemoproteomics",108,31578252,"pFind PSM Score",0.0032684,,2.4390200,,,,-0.0033845
SCLWHATDFSDGELK,so,C,118,true,"Arabidopsis S-sulfenylation chemoproteomics",108,31578252,"pFind PSM Score",0.0000127,,3.8461500,,,,-1.3122436
DFSDGELKDELFCIR,sno,C,136,false,"hot5-4 / wildtype, FAT-switch S-nitrosoproteome",169,37277371,,,,,,,,
DELFCIR,sno,C,136,false,"hot5-4 / wildtype, FAT-switch S-nitrosoproteome",169,37277371,,,,,,,,
DELFCIR,so,C,136,false,"Arabidopsis S-sulfenylation chemoproteomics",108,31578252,"pFind PSM Score",0.2084720,,,,,,-1.3779312
FASIENCK,ox,C,145,false,"OxiTRAQ Arabidopsis - 5 mM H2O2 versus control",47,24376095,,,,-0.0701871,0.7754556,NO,,
FASIENCK,sno,C,145,false,"hot5-4 / wildtype, FAT-switch S-nitrosoproteome",169,37277371,,,,0.6112526,0.0000129,YES,,
FASIENCK,so,C,145,false,"Arabidopsis S-sulfenylation chemoproteomics",108,31578252,"pFind PSM Score",0.0100527,,2.3614800,,,,1.2064125
FASIENCK,so,C,145,false,"S-sulfenylation site detection using YAP1C",110,32714340,,,,,,,,
