Peptide,PTM,ModifiedAA,ModifiedPosition,PeptideUniqueToGene,ExperimentDesc,ExpID,PubmedID,ScoreType,IdentScore,LocProb,Log2FChange,PQ-val,QuantSig,PEP,MassErrorPPM
IHDTYSPTTASFK,ph,S,17,true,"Tissue atlas Arabidopsis - ProteomicsDB",114,32188942,"MaxQuant score",273.7200000,0.9995980,,,,0,
IHDTYSPTTASFK,ph,T,19,true,"Tissue atlas Arabidopsis - ProteomicsDB",114,32188942,"MaxQuant score",114.5000000,0.8101340,,,,0.00058309198357165,
IHDTYSPTTASFK,ph,S,22,true,"Tissue atlas Arabidopsis - ProteomicsDB",114,32188942,"MaxQuant score",186.6900000,0.9964410,,,,2.8981500102146E-22,
DIHHLCSDDSPSFPSSPSPSPK,ph,S,40,true,"Tissue atlas Arabidopsis - ProteomicsDB",114,32188942,"MaxQuant score",160.2100000,0.9197140,,,,2.0331600568212E-38,
DIHHLCSDDSPSFPSSPSPSPK,ph,S,42,true,"Tissue atlas Arabidopsis - ProteomicsDB",114,32188942,"MaxQuant score",155.8700000,0.7609630,,,,1.1121700095311E-37,
DIHHLCSDDSPSFPSSPSPSPK,ph,S,44,true,"Tissue atlas Arabidopsis - ProteomicsDB",114,32188942,"MaxQuant score",119.1400000,0.9522280,,,,2.2257200773557E-21,
ADSEPINLSR,ph,S,78,true,"Pollen phosphoproteome Arabidopsis",43,22631563,"MASCOT Score",58.0700000,,,,,,-1.0785200
ADSEPINLSR,ph,S,78,true,"atm and atr DNA damage response",88,25561503,"MASCOT Score",48.0000000,1.0000000,,,,,-0.7800000
ADSEPINLSR,ph,S,78,true,"TOR Kinase and ABA Receptor",100,29290610,XCorr,3.3875020,1.0000000,,,,3.1029998353915E-5,
ADSEPINLSR,ph,S,78,true,"Tissue atlas Arabidopsis - ProteomicsDB",114,32188942,"MaxQuant score",224.6600000,1.0000000,,,,2.3234101070647E-28,
ADSEPINLSR,ph,S,84,true,"Tissue atlas Arabidopsis - ProteomicsDB",114,32188942,"MaxQuant score",74.6110000,1.0000000,,,,0.0042573399841785,
