Peptide,PTM,ModifiedAA,ModifiedPosition,PeptideUniqueToGene,ExperimentDesc,ExpID,PubmedID,ScoreType,IdentScore,LocProb,Log2FChange,PQ-val,QuantSig,PEP,MassErrorPPM
ASVSKSNHLEEDDDAEEE,nta,A,2,true,"HUNTER N-terminome: legumain, GluC and trypsin",119,31951383,"MaxQuant score",99.9410000,,,,,,
SDTAEHYGSESR,ph,S,262,true,"Tissue atlas Arabidopsis - ProteomicsDB",114,32188942,"MaxQuant score",125.3200000,0.9979890,,,,3.5992699849885E-5,
KRDSSIAEDTSK,ph,S,540,true,"Tissue atlas Arabidopsis - ProteomicsDB",114,32188942,"MaxQuant score",187.5600000,0.9776180,,,,1.4946300638827E-19,
TNSVNQSPTDAIRR,ph,T,559,true,"Tissue atlas Arabidopsis - ProteomicsDB",114,32188942,"MaxQuant score",63.4080000,0.9781590,,,,0.0064702699892223,
TNSVNQSPTDAIR,ph,S,561,true,"srk2dei ABA signaling phopshoproteomics",83,23572148,"MASCOT Score",59.0000000,,,,,,-0.0004000
TNSVNQSPTDAIR,ph,S,561,true,"LAXIC - ABA stress",84a,23660473,XCorr,3.6500000,0.9960000,,,,0.00026464700931683,
TNSVNQSPTDAIR,ph,S,561,true,"LAXIC - mannitol vs control",84b,23660473,XCorr,3.3800000,0.9950000,,,,0.0078728497028351,
TNSVNQSPTDAIR,ph,S,561,true,"SnRK2 protein kinase substrates",85,23776212,XCorr,2.9417725,0.9960000,,,,1.2412099749781E-5,
TNSVNQSPTDAIR,ph,S,561,true,"atm and atr DNA damage response",88,25561503,"MASCOT Score",75.0000000,1.0000000,,,,,-0.3000000
TNSVNQSPTDAIR,ph,S,561,true,"TOR Kinase and ABA Receptor",100,29290610,XCorr,3.3950064,0.9991000,,,,1.7940000134331E-6,
TNSVNQSPTDAIR,ph,S,561,true,"Phospho cell culture sucrose/TOR",109,30833711,,,0.9996610,,,,,
TNSVNQSPTDAIR,ph,S,561,true,"Tissue atlas Arabidopsis - ProteomicsDB",114,32188942,"MaxQuant score",292.6300000,1.0000000,,,,0,
TNSVNQSPTDAIR,ph,S,565,true,"Tissue atlas Arabidopsis - ProteomicsDB",114,32188942,"MaxQuant score",115.2600000,0.9102340,,,,7.4449599196669E-5,
LEQLYLIMK,ph,Y,774,true,"SnRK2 protein kinase substrates",85,23776212,XCorr,2.4130976,1.0000000,,,,0.13594099879265,
