Peptide,PTM,ModifiedAA,ModifiedPosition,PeptideUniqueToGene,ExperimentDesc,ExpID,PubmedID,ScoreType,IdentScore,LocProb,Log2FChange,PQ-val,QuantSig,PEP,MassErrorPPM
MMGSENADGFEETNLNAQR,nta,M,1,true,"Arg/N-end rule seed, prt6 vs. Wt",99,29168982,"MASCOT Score",66.2600000,,,,,0.0014570000348613,-1.2445907
MMGSENADGFEETNLNAQR,nta,M,1,true,"HUNTER N-terminome: legumain, GluC and trypsin",119,31951383,"MaxQuant score",107.3700000,,,,,,
MMGSENADGFEETNLNAQR,nta,M,1,true,"Arabidopsis translation initiation landscape - NTA",167a,35069635,,,,,,,,
GSENADGFEETNLNAQR,nt,G,3,true,"Arg/N-end rule seed, prt6 vs. Wt",99,29168982,"MASCOT Score",84.4100000,,,,,0.0003625999961514,-1.8042817
DDMENLDLGVDGGDHPLKISDVNGDTSNSGYR,ph,S,39,true,"Tissue atlas Arabidopsis - ProteomicsDB",114,32188942,"MaxQuant score",100.8100000,0.9904940,,,,2.3867699127467E-25,
ISDVNGDTSNSGYR,ph,T,45,true,"Tissue atlas Arabidopsis - ProteomicsDB",114,32188942,"MaxQuant score",116.5800000,0.7967480,,,,0.0001319360017078,
ISDVNGDTSNSGYR,ph,S,46,true,"Tissue atlas Arabidopsis - ProteomicsDB",114,32188942,"MaxQuant score",189.4700000,0.8736030,,,,1.1721900141352E-24,
ISDVNGDTSNSGYR,ph,S,48,true,"Tissue atlas Arabidopsis - ProteomicsDB",114,32188942,"MaxQuant score",237.0500000,0.9949040,,,,0,
SAMSTLSNVR,ph,S,55,true,"atm and atr DNA damage response",88,25561503,"MASCOT Score",31.0000000,0.9320000,,,,,1.1900000
SAMSTLSNVR,ph,S,55,true,"Tissue atlas Arabidopsis - ProteomicsDB",114,32188942,"MaxQuant score",107.0900000,0.9785200,,,,7.0762900577392E-5,
SPSSSSSDYIK,ph,S,144,true,"STN8 phosphoproteome",38,21768351,"MASCOT Score",49.1200000,,,,,,-0.5630840
SPSSSSSDYIK,ph,S,144,true,"Chloroplast kinase substrates",60,19376835,"MASCOT Score",48.0500000,,,,,,-0.4661930
SPSSSSSDYIK,ph,S,144,true,"atm and atr DNA damage response",88,25561503,"MASCOT Score",45.0000000,1.0000000,,,,,-0.6400000
SPSSSSSDYIK,ph,S,144,true,"Lateral root-induction - NAA vs control",106,23328941,"MASCOT Score",24.0000000,,,,,,
SPSSSSSDYIK,ph,S,144,true,"Phospho cell culture sucrose/TOR",109,30833711,,,0.9415960,,,,,
SPSSSSSDYIK,ph,S,144,true,"Tissue atlas Arabidopsis - ProteomicsDB",114,32188942,"MaxQuant score",179.9400000,0.9683970,,,,5.2694800562955E-14,
SPSSSSSDYIK,ph,S,146,true,"Tyrosine phosphorylation in Arabidopsis",59,18463617,"MASCOT Score",45.0000000,,,,,,-0.6469926
SPSSSSSDYIK,ph,S,146,true,"LAXIC - ABA stress",84a,23660473,XCorr,2.7800000,0.9900000,,,,0.042175401002169,
SPSSSSSDYIK,ph,S,146,true,"LAXIC - mannitol vs control",84b,23660473,XCorr,2.6700000,0.8980000,,,,0.12158799916506,
SPSSSSSDYIK,ph,S,146,true,"SnRK2 protein kinase substrates",85,23776212,XCorr,2.4134960,0.9380000,,,,0.17486600577831,
SPSSSSSDYIK,ph,S,146,true,"atm and atr DNA damage response",88,25561503,"MASCOT Score",42.0000000,0.9440000,,,,,-0.6400000
SPSSSSSDYIK,ph,S,146,true,"Protein sumoylation and phosphorylation cross-talk",97,28419593,,,,,,,,
SPSSSSSDYIK,ph,S,146,true,"Phospho cell culture sucrose/TOR",109,30833711,,,0.9934620,,,,,
SPSSSSSDYIK,ph,S,146,true,"Tissue atlas Arabidopsis - ProteomicsDB",114,32188942,"MaxQuant score",209.8400000,0.9991750,,,,7.7346401668052E-25,
SPSSSSSDYIK,ph,S,147,true,"Tyrosine phosphorylation in Arabidopsis",59,18463617,"MASCOT Score",37.0000000,,,,,,-0.8087408
QLFGEGGASAVPVTEVGQPARGGR,me1,R,319,true,"Arabidopsis protein methylome",123,31809900,"MaxQuant Score",79.6900000,1.0000000,,,,1.4247100027509E-11,-0.6895700
QSVSNDWGGSKPPVVEEDKEFLEK,ph,S,336,false,"Tissue atlas Arabidopsis - ProteomicsDB",114,32188942,"MaxQuant score",255.3400000,0.9999960,,,,0,
QSVSNDWGGSKPPVVEEDK,ph,S,336,false,"srk2dei ABA signaling phopshoproteomics",83,23572148,"MASCOT Score",27.0000000,,,,,,-0.0006000
QSVSNDWGGSKPPVVEEDK,ph,S,336,false,"TOR Kinase and ABA Receptor",100,29290610,XCorr,2.0915432,0.9982000,,,,0.0067460001446307,
VTEDAKNVAIK,ac,K,519,true,"Quantitative Acetylproteomics",101,29440448,,,,,,,,
