Peptide,PTM,ModifiedAA,ModifiedPosition,PeptideUniqueToGene,ExperimentDesc,ExpID,PubmedID,ScoreType,IdentScore,LocProb,Log2FChange,PQ-val,QuantSig,PEP,MassErrorPPM
LGGAFAPKPSSGPHKSR,ac,K,37,false,"Quantitative Acetylproteomics",101,29440448,,,,,,,,
SRECLPLVLIIR,acy,C,41,false,"Arabidopsis S-acylation atlas - Stem",163f,35681017,,,,,,,,
SRECLPLVLIIR,cn,C,41,false,"Cellular regulation by S-cyanylation",115,30377236,,,,,,,,
SRECLPLVLIIR,so,C,41,false,"S-sulfenylation site detection using YAP1C",110,32714340,,,,,,,,
EVISILMQR,nt,E,60,false,"Arg/N-end rule pathway Roots",80,25728785,"MASCOT Score",33.9800000,,,,,0.0027970001101494,
TDKTYPAGFMDVVSIPKTNENFR,nt,T,78,false,"Arabidopsis translation initiation landscape - NT",167b,35069635,,,,,,,,
TDKTYPAGFMDVVSIPKTNENFR,ac,K,94,false,"Quantitative Acetylproteomics",101,29440448,,,,,,,,
TYPAGFMDVVSIPKTNENFR,ac,K,94,false,"Quantitative Acetylproteomics",101,29440448,,,,,,,,
LLYDTKGR,ac,K,106,false,"Quantitative Acetylproteomics",101,29440448,,,,,,,,
LHSIKDEEAK,ph,S,113,false,"Tissue atlas Arabidopsis - ProteomicsDB",114,32188942,"MaxQuant score",82.8500000,1.0000000,,,,0.00061048200586811,
LHSIKDEEAKFK,ac,K,120,false,"Quantitative Acetylproteomics",101,29440448,,,,,,,,
DEEAKFK,ac,K,120,false,"Quantitative Acetylproteomics",101,29440448,,,,,,,,
SIQFGQKGIPYLNTYDGR,nt,S,128,false,"Arabidopsis translation initiation landscape - NT",167b,35069635,,,,,,,,
VRSIQFGQK,ph,S,128,false,"Arabidopsis root NAA phosphoproteome",18a,27643528,"MaxQuant Score",40.7670000,1.0000000,,,,0.0070000002160668,-0.1120000
VRSIQFGQK,ph,S,128,false,"Tyrosine phosphorylation in Arabidopsis",59,18463617,"MASCOT Score",25.0000000,,,,,,-0.7883924
VRSIQFGQK,ph,S,128,false,"Conserved plant phosphoproteome - Arabidopsis",61a,20466843,"MASCOT Score",48.0000000,1.0000000,,,,,
VRSIQFGQK,ph,S,128,false,"srk2dei ABA signaling phopshoproteomics",83,23572148,"MASCOT Score",36.0000000,,,,,,0.0007000
VRSIQFGQK,ph,S,128,false,"atm and atr DNA damage response",88,25561503,"MASCOT Score",43.0000000,1.0000000,,,,,-1.3500000
VRSIQFGQK,ph,S,128,false,"TOR Kinase and ABA Receptor",100,29290610,XCorr,3.6235864,1.0000000,,,,0.0047419997863472,
VRSIQFGQK,ph,S,128,false,"Phospho cell culture sucrose/TOR",109,30833711,,,1.0000000,,,,,
VRSIQFGQK,ph,S,128,false,"Tissue atlas Arabidopsis - ProteomicsDB",114,32188942,"MaxQuant score",170.0400000,1.0000000,,,,0.00013053099974059,
QKGIPYLNTYD,nt,Q,133,false,"HUNTER N-terminome: legumain, GluC and trypsin",119,31951383,"MaxQuant score",100.9800000,,,,,,
SIQFGQKGIPYLNTYDGR,ub,K,134,false,"upl3 mutant / wildtype",168,35926874,"MaxQuant score",67.6450000,1.0000000,-0.7883647,0.1794790,NO,7.4561998189893E-5,-1.0629000
GSFETIHIQDSTGHEFATR,ph,S,204,false,"Phospho cell culture sucrose/TOR",109,30833711,,,0.9734040,,,,,
GTKPWVSLPK,ph,T,232,false,"atm and atr DNA damage response",88,25561503,"MASCOT Score",29.0000000,1.0000000,,,,,-2.9900000
