Peptide,PTM,ModifiedAA,ModifiedPosition,PeptideUniqueToGene,ExperimentDesc,ExpID,PubmedID,ScoreType,IdentScore,LocProb,Log2FChange,PQ-val,QuantSig,PEP,MassErrorPPM
AMEIGEDEWKVCCGSSEFAKQMSTSGPLTSQEAIYTAR,nta,A,2,true,"HUNTER N-terminome: legumain, GluC and trypsin",119,31951383,"MaxQuant score",71.3590000,,,,,,
AMEIGEDEWK,nta,A,2,true,"Characterization plant N-terminal acetylation",6,22223895,"MASCOT Score",72.4400000,,,,,,
VCCGSSEFAK,ph,S,17,true,"Tissue atlas Arabidopsis - ProteomicsDB",114,32188942,"MaxQuant score",91.3130000,0.8048770,,,,0.0011085199657828,
VISETDSSSSPVSTKPQDR,ph,S,171,true,"Conserved plant phosphoproteome - Arabidopsis",61a,20466843,"MASCOT Score",39.0000000,1.0000000,,,,,
VISETDSSSSPVSTKPQDR,ph,S,172,true,"Large-scale phosphorylation discovery",44,23111157,XCorr,4.8720000,,,,,,
VISETDSSSSPVSTKPQDR,ph,S,172,true,"Conserved plant phosphoproteome - Arabidopsis",61a,20466843,"MASCOT Score",39.0000000,1.0000000,,,,,
VISETDSSSSPVSTKPQDR,ph,S,173,true,"Conserved plant phosphoproteome - Arabidopsis",61a,20466843,"MASCOT Score",39.0000000,1.0000000,,,,,
VISETDSSSSPVSTKPQDR,ph,S,173,true,"Phospho cell culture sucrose/TOR",109,30833711,,,0.9649390,,,,,
VISETDSSSSPVSTKPQDR,ph,S,173,true,"Tissue atlas Arabidopsis - ProteomicsDB",114,32188942,"MaxQuant score",305.6300000,0.9982640,,,,0,
SRPPITTHVLDVSR,nt,S,202,true,"N-terminal ChaFRADIC",92,26010716,"MASCOT Score",47.8100000,,,,,1.1379999875771E-7,
