Peptide,PTM,ModifiedAA,ModifiedPosition,PeptideUniqueToGene,ExperimentDesc,ExpID,PubmedID,ScoreType,IdentScore,LocProb,Log2FChange,PQ-val,QuantSig,PEP,MassErrorPPM
AAEKWVAKNVSTHISTDNVNIR,ng,N,97,true,"N-Glycopeptide Profiling in Arabidopsis Infloresce",132,27067053,"MOWSE score",43.5000000,,,,,9.8999997135252E-5,
WVAKNVSTHISTDNVNIR,ng,N,97,true,"N-Glycopeptide Profiling in Arabidopsis Infloresce",132,27067053,"MOWSE score",39.5000000,,,,,0.00015000000712462,
NVSTHISTDNVNIR,ng,N,97,true,"Conserved N-glycosylation",74,22633491,"MaxQuant Score",204.6000000,1.0000000,,,,1.3239467890941E-41,0.2010000
NVSTHISTDNVNIR,ng,N,97,true,"N-glycan occupancy Arabidopsis glycoproteins",87,23994444,"Ladder score",50.6000000,,,,,,
NVSTHISTDNVNIR,ng,N,97,true,"N-Glycopeptide Profiling in Arabidopsis Infloresce",132,27067053,"MOWSE score",44.3000000,,,,,2.099999960592E-7,
NVSTHISTDNVNIR,ng,N,97,true,"N-linked Glycan Micro-heterogeneity Arabidopsis",134,29237727,,,,,,,,
NVSTHISTDNVNIR,ng,N,97,true,"UDP-GlcNAc transporter glycopeptide analysis",135,30224661,,,,,,,5.1175970432761E-17,0.6000000
YVAVGNEPFLSTYNGSYLSTTFPALR,ng,N,124,true,"Conserved N-glycosylation",74,22633491,"MaxQuant Score",168.1200000,1.0000000,,,,0,2.0640000
YVAVGNEPFLSTYNGSYLSTTFPALR,ng,N,124,true,"N-linked Glycan Micro-heterogeneity Arabidopsis",134,29237727,,,,,,,,
QNISYAFNSYYQIQDQLDTACK,ng,N,406,true,"Conserved N-glycosylation",74,22633491,"MaxQuant Score",222.5500000,1.0000000,,,,0,2.4640000
FPNISEVTK,ng,N,429,true,"Conserved N-glycosylation",74,22633491,"MaxQuant Score",85.2260000,1.0000000,,,,0.0049999998882413,0.1850000
FPNISEVTK,ng,N,429,true,"N-linked Glycan Micro-heterogeneity Arabidopsis",134,29237727,,,,,,,,
FPNISEVTK,ng,N,429,true,"UDP-GlcNAc transporter glycopeptide analysis",135,30224661,,,,,,,1.3881748600397E-5,0.4000000
TDPSTGTCR,sno,C,443,true,"hot5-4 / wildtype, FAT-switch S-nitrosoproteome",169,37277371,,,,-0.3674733,0.0041790,NO,,
