Peptide,PTM,ModifiedAA,ModifiedPosition,PeptideUniqueToGene,ExperimentDesc,ExpID,PubmedID,ScoreType,IdentScore,LocProb,Log2FChange,PQ-val,QuantSig,PEP,MassErrorPPM
QSVQHEEYKVHAYNR,nt,Q,59,true,"Arabidopsis translation initiation landscape - NT",167b,35069635,,,,,,,,
ELDETKIILHK,ph,T,150,false,"Tissue atlas Arabidopsis - ProteomicsDB",114,32188942,"MaxQuant score",87.4980000,1.0000000,,,,0.00025832199025899,
IILHKTIDSVLAR,ub,K,156,true,"upl3 mutant / wildtype",168,35926874,"MaxQuant score",109.0000000,1.0000000,-0.5332424,0.1727000,NO,7.5662701419787E-6,-0.5345500
IILHKTIDSVLAR,ph,T,157,true,"Tissue atlas Arabidopsis - ProteomicsDB",114,32188942,"MaxQuant score",68.8200000,0.9885370,,,,0.0014522899873555,
TIDSVLAR,ph,S,160,true,"Tissue atlas Arabidopsis - ProteomicsDB",114,32188942,"MaxQuant score",112.7100000,1.0000000,,,,0.0034851799719036,
GEKLDSLVEK,ub,K,167,false,"upl3 mutant / wildtype",168,35926874,"MaxQuant score",55.7540000,1.0000000,-0.3547595,,,0.0036091399379075,0.0728870
GEKLDSLVEK,ph,S,170,false,"atm and atr DNA damage response",88,25561503,"MASCOT Score",28.0000000,1.0000000,,,,,-3.5800000
LDSLVEK,ph,S,170,false,"Tissue atlas Arabidopsis - ProteomicsDB",114,32188942,"MaxQuant score",161.2000000,1.0000000,,,,1.0372000360803E-6,
SSDLSMASQMFYK,ph,S,182,true,"Tissue atlas Arabidopsis - ProteomicsDB",114,32188942,"MaxQuant score",188.0900000,0.9999700,,,,1.4873000491307E-22,
