Peptide,PTM,ModifiedAA,ModifiedPosition,PeptideUniqueToGene,ExperimentDesc,ExpID,PubmedID,ScoreType,IdentScore,LocProb,Log2FChange,PQ-val,QuantSig,PEP,MassErrorPPM
TMSLGVGGNGETSGVR,ph,S,7,true,"atm and atr DNA damage response",88,25561503,"MASCOT Score",70.0000000,1.0000000,,,,,0.2100000
TMSLGVGGNGETSGVR,ph,S,7,true,"Tissue atlas Arabidopsis - ProteomicsDB",114,32188942,"MaxQuant score",205.4500000,0.9999970,,,,0,
RNLSSPFDGISSER,ph,S,154,true,"atm and atr DNA damage response",88,25561503,"MASCOT Score",25.0000000,1.0000000,,,,,0.5100000
NLSSPFDGISSER,ph,S,154,true,"STN8 phosphoproteome",38,21768351,"MASCOT Score",48.5200000,,,,,,-0.0774564
NLSSPFDGISSER,ph,S,154,true,"atm and atr DNA damage response",88,25561503,"MASCOT Score",52.0000000,0.9940000,,,,,0.0300000
NLSSPFDGISSER,ph,S,154,true,"Protein sumoylation and phosphorylation cross-talk",97,28419593,,,,,,,,
NLSSPFDGISSER,ph,S,154,true,"Lateral root-induction - NAA vs control",106,23328941,"MASCOT Score",28.0000000,,,,,,
NLSSPFDGISSER,ph,S,154,true,"Phospho cell culture sucrose/TOR",109,30833711,,,0.9968530,,,,,
NLSSPFDGISSER,ph,S,154,true,"Tissue atlas Arabidopsis - ProteomicsDB",114,32188942,"MaxQuant score",198.8500000,0.9999610,,,,7.4216199412612E-31,
RNLSSPFDGISSER,ph,S,155,true,"TOR Kinase and ABA Receptor",100,29290610,XCorr,3.2583091,0.9015000,,,,0.0022189998999238,
NLSSPFDGISSER,ph,S,155,true,"Tissue atlas Arabidopsis - ProteomicsDB",114,32188942,"MaxQuant score",59.7570000,0.9059540,,,,0.0074955299496651,
KGLVESSSVSPR,ph,S,187,true,"atm and atr DNA damage response",88,25561503,"MASCOT Score",43.0000000,0.9970000,,,,,-3.5600000
KGLVESSSVSPR,ph,S,189,true,"atm and atr DNA damage response",88,25561503,"MASCOT Score",67.0000000,0.9970000,,,,,-1.9700000
GLVESSSVSPR,ph,S,189,true,"Lateral root-induction - NAA vs control",106,23328941,"MASCOT Score",52.0000000,,,,,,
GLVESSSVSPR,ph,S,189,true,"Tissue atlas Arabidopsis - ProteomicsDB",114,32188942,"MaxQuant score",173.7100000,0.9997270,,,,4.1117998932181E-15,
RESISHALVSQVSNTILESAK,ph,S,230,true,"Large-scale phosphorylation discovery",44,23111157,XCorr,5.7370000,,,,,,
RESISHALVSQVSNTILESAK,ph,S,230,true,"TOR Kinase and ABA Receptor",100,29290610,XCorr,5.4469304,0.9080000,,,,5.6739997944533E-7,
RESISHALVSQVSNTILESAK,ph,S,240,true,"Tissue atlas Arabidopsis - ProteomicsDB",114,32188942,"MaxQuant score",70.4970000,0.8574980,,,,4.2150099034188E-5,
DASLETPILSPK,ph,T,273,true,"Tissue atlas Arabidopsis - ProteomicsDB",114,32188942,"MaxQuant score",185.2700000,1.0000000,,,,5.6991199703604E-20,
DASLETPILSPK,ph,S,277,true,"Phosphoproteomic analysis of seed maturation",42,22440515,"MASCOT Score",31.0000000,,,,,,-3.4200000
DASLETPILSPK,ph,S,277,true,"Tyrosine phosphorylation in Arabidopsis",59,18463617,"MASCOT Score",40.0000000,,,,,,-0.8891215
DASLETPILSPK,ph,S,277,true,"atm and atr DNA damage response",88,25561503,"MASCOT Score",79.0000000,1.0000000,,,,,-0.3800000
DASLETPILSPK,ph,S,277,true,"TOR Kinase and ABA Receptor",100,29290610,XCorr,3.3097923,1.0000000,,,,8.9770001068246E-5,
DASLETPILSPK,ph,S,277,true,"Lateral root-induction - NAA vs control",106,23328941,"MASCOT Score",47.0000000,,,,,,
DASLETPILSPK,ph,S,277,true,"Tissue atlas Arabidopsis - ProteomicsDB",114,32188942,"MaxQuant score",236.9200000,1.0000000,,,,0,
ESLTIISEEEEAEER,ph,S,298,true,"Tissue atlas Arabidopsis - ProteomicsDB",114,32188942,"MaxQuant score",122.7500000,0.9921020,,,,3.0213500394893E-6,
DTSIKGEHLSLLK,ph,S,329,true,"Tissue atlas Arabidopsis - ProteomicsDB",114,32188942,"MaxQuant score",116.3600000,0.9902960,,,,0.00015458799316548,
