Peptide,PTM,ModifiedAA,ModifiedPosition,PeptideUniqueToGene,ExperimentDesc,ExpID,PubmedID,ScoreType,IdentScore,LocProb,Log2FChange,PQ-val,QuantSig,PEP,MassErrorPPM
IEVGEVGNLAVKNSKVVSLEEISSDK,sumo,K,264,true,"SUMO Ligase SIZ1 heat stress",4,29588388,,,,,,,,
ELAEIDSVSSPEVK,ph,S,437,true,"Tissue atlas Arabidopsis - ProteomicsDB",114,32188942,"MaxQuant score",296.4900000,0.9741180,,,,0,
VHLKPMSPLVAEQAK,ph,S,537,true,"Tissue atlas Arabidopsis - ProteomicsDB",114,32188942,"MaxQuant score",112.3200000,1.0000000,,,,1.3522300150726E-6,
KKSPPGSPVQTDLVLGR,ph,S,548,true,"SnRK2 protein kinase substrates",85,23776212,XCorr,2.3734457,1.0000000,,,,6.1856599131715E-7,
KKSPPGSPVQTDLVLGR,ph,S,548,true,"TOR Kinase and ABA Receptor",100,29290610,XCorr,3.9813533,1.0000000,,,,9.0200001068297E-6,
KKSPPGSPVQTDLVLGR,ph,S,548,true,"Tissue atlas Arabidopsis - ProteomicsDB",114,32188942,"MaxQuant score",153.1000000,1.0000000,,,,2.40687000495E-13,
KKSPPGSPVQTDLVLGR,ph,S,552,true,"SnRK2 protein kinase substrates",85,23776212,XCorr,2.3734457,1.0000000,,,,6.1856599131715E-7,
KKSPPGSPVQTDLVLGR,ph,S,552,true,"TOR Kinase and ABA Receptor",100,29290610,XCorr,3.9813533,1.0000000,,,,9.0200001068297E-6,
KKSPPGSPVQTDLVLGR,ph,S,552,true,"Tissue atlas Arabidopsis - ProteomicsDB",114,32188942,"MaxQuant score",153.1000000,1.0000000,,,,2.40687000495E-13,
