Peptide,PTM,ModifiedAA,ModifiedPosition,PeptideUniqueToGene,ExperimentDesc,ExpID,PubmedID,ScoreType,IdentScore,LocProb,Log2FChange,PQ-val,QuantSig,PEP,MassErrorPPM
MDSGNNNMNR,nta,M,2,true,"Arg/N-end rule pathway Roots",80,25728785,"MASCOT Score",36.4100000,,,,,0.016909999772906,
LCSSLEPILR,so,C,48,false,"S-sulfenylation site detection using YAP1C",110,32714340,,,,,,,,
SSLEPILR,nt,S,49,false,"Arg/N-end rule seed, prt6 vs. Wt",99,29168982,"MASCOT Score",35.4900000,,-0.2015927,0.4905729,NO,0.14059999585152,-0.8575892
LCSSLEPILR,ph,S,49,false,"Tissue atlas Arabidopsis - ProteomicsDB",114,32188942,"MaxQuant score",202.3100000,0.9989280,,,,2.5530298881232E-19,
RVVSEELER,ph,S,60,true,"atm and atr DNA damage response",88,25561503,"MASCOT Score",29.0000000,1.0000000,,,,,-0.8000000
RVVSEELER,ph,S,60,true,"TOR Kinase and ABA Receptor",100,29290610,XCorr,3.6819448,1.0000000,,,,0.00088240002514794,
RVVSEELER,ph,S,60,true,"Tissue atlas Arabidopsis - ProteomicsDB",114,32188942,"MaxQuant score",71.1760000,1.0000000,,,,0.0062769697979093,
LTGSSGSSPKR,ph,T,76,true,"atm and atr DNA damage response",88,25561503,"MASCOT Score",22.0000000,1.0000000,,,,,-0.3700000
LTGSSGSSPK,ph,T,76,true,"atm and atr DNA damage response",88,25561503,"MASCOT Score",35.0000000,1.0000000,,,,,0.9400000
LTGSSGSSPK,ph,S,78,true,"atm and atr DNA damage response",88,25561503,"MASCOT Score",30.0000000,0.9330000,,,,,-0.6500000
LTGSSGSSPKR,ph,S,79,true,"atm and atr DNA damage response",88,25561503,"MASCOT Score",34.0000000,0.8500000,,,,,0.5600000
LTGSSGSSPKR,ph,S,81,true,"atm and atr DNA damage response",88,25561503,"MASCOT Score",23.0000000,1.0000000,,,,,-0.7800000
LTGSSGSSPKR,ph,S,82,true,"atm and atr DNA damage response",88,25561503,"MASCOT Score",23.0000000,1.0000000,,,,,-0.7800000
LTGSSGSSPKR,ph,S,82,true,"Tissue atlas Arabidopsis - ProteomicsDB",114,32188942,"MaxQuant score",112.0200000,0.9410440,,,,6.3461297941103E-6,
LTGSSGSSPK,ph,S,82,true,"atm and atr DNA damage response",88,25561503,"MASCOT Score",30.0000000,0.9950000,,,,,-1.6300000
ERGPDDFFSEEEIR,ph,S,543,true,"Tissue atlas Arabidopsis - ProteomicsDB",114,32188942,"MaxQuant score",74.2960000,1.0000000,,,,0.0013722999719903,
