Peptide,PTM,ModifiedAA,ModifiedPosition,PeptideUniqueToGene,ExperimentDesc,ExpID,PubmedID,ScoreType,IdentScore,LocProb,Log2FChange,PQ-val,QuantSig,PEP,MassErrorPPM
ASGLEDIVNENVDLEK,nta,A,2,true,"Characterization plant N-terminal acetylation",6,22223895,"MASCOT Score",43.8500000,,,,,,
IPIEEVFQQLKCSR,ub,K,28,false,"Ubiquitination Membrane Proteins",120,33585938,,,,,,,,
IPIEEVFQQLKCSR,ub,K,28,false,"upl3 mutant / wildtype",168,35926874,"MaxQuant score",183.0000000,1.0000000,0.9664305,0.1437220,NO,4.3700701393607E-19,0.3851700
DGKWSEQEASILVPGDIVSIK,ub,K,140,false,"Ubiquitination Membrane Proteins",120,33585938,,,,,,,,
DGKWSEQEASILVPGDIVSIK,ub,K,140,false,"upl3 mutant / wildtype",168,35926874,"MaxQuant score",66.4670000,1.0000000,0.8929738,0.1010440,NO,2.759840026556E-5,-0.2688200
LLEGDPLKVDQSALTGESLPATK,ub,K,176,true,"upl3 mutant / wildtype",168,35926874,"MaxQuant score",141.6900000,1.0000000,-0.1959464,,,1.4090499698248E-21,0.9975000
GPGEEVFSGSTCK,sno,C,203,true,"hot5-4 / wildtype, FAT-switch S-nitrosoproteome",169,37277371,,,,,,,,
LSQQGAITKR,ac,K,313,false,"Quantitative Acetylproteomics",101,29440448,,,,,,,,
LSQQGAITKR,ub,K,313,false,"Ubiquitination Membrane Proteins",120,33585938,,,,,,,,
MTAIEEMAGMDVLCSDK,ph,T,316,false,"Brassinosteroid-Regulated Phosphorylation Dynamics",94,26187819,"MaxQuant Score",58.9140000,1.0000000,,,,0.01799999922514,-0.0650000
MTAIEEMAGMDVLCSDK,ph,S,329,false,"Phosphorylation in N starvation",63,22060019,"MASCOT Score",99.0000000,,,,,,-1.1356600
MTAIEEMAGMDVLCSDK,ph,S,329,false,"Brassinosteroid-Regulated Phosphorylation Dynamics",94,26187819,"MaxQuant Score",58.9140000,1.0000000,,,,0.01799999922514,-0.0650000
RMTAIEEMAGMDVLCSDKTGTLTLNK,ub,K,331,false,"Arabidopsis ubiquitination by TUBEs",2,23667124,,,,,,,,
TGTLTLNK,ph,T,336,false,"Tissue atlas Arabidopsis - ProteomicsDB",114,32188942,"MaxQuant score",123.4200000,0.9975070,,,,0.0081411302089691,
TGTLTLNKLSVDK,ub,K,339,false,"Ubiquitination Membrane Proteins",120,33585938,,,,,,,,
TGTLTLNKLSVDK,ub,K,339,false,"upl3 mutant / wildtype",168,35926874,"MaxQuant score",171.7300000,1.0000000,-0.3400754,0.4685600,NO,1.1702800428657E-16,-1.0035000
VENQDAIDAAMVGMLADPKEAR,ub,K,387,false,"Ubiquitination Membrane Proteins",120,33585938,,,,,,,,
VENQDAIDAAMVGMLADPKEAR,ub,K,387,false,"upl3 mutant / wildtype",168,35926874,"MaxQuant score",106.6300000,1.0000000,0.6906406,0.4766800,NO,2.0703499678532E-11,-1.4646000
EIHFLPFNPVDKR,ac,K,406,false,"Quantitative Acetylproteomics",101,29440448,,,,,,,,
GAPEQILDLCNAR,ox,C,434,true,"SPEAR - 50 mM H2O2 / mock",138b,34619326,,,,0.8222088,0.0291023,YES,,
GAPEQILDLCNAR,sno,C,434,true,"hot5-4 / wildtype, FAT-switch S-nitrosoproteome",169,37277371,,,,0.2973399,0.0854314,NO,,
ADGFAGVFPEHKYEIVKK,ac,K,570,false,"Quantitative Acetylproteomics",101,29440448,,,,,,,,
ADGFAGVFPEHKYEIVK,ac,K,570,false,"Histone deacetylases substrates - hda14 vs WT",98e,29061669,"MaxQuant Score",46.2000000,1.0000000,-0.4210000,0.8375293,NO,0.00098000001162291,
ADGFAGVFPEHKYEIVK,ac,K,570,false,"Quantitative Acetylproteomics",101,29440448,,,,,,,,
HICGMTGDGVNDAPALK,sno,C,584,false,"hot5-4 / wildtype, FAT-switch S-nitrosoproteome",169,37277371,,,,,,,,
TAFTTKQNYGIEER,ac,K,864,true,"Quantitative Acetylproteomics",101,29440448,,,,,,,,
EAQWAHAQRTLHGLQNTETANVVPER,ph,T,882,true,"TOR Kinase and ABA Receptor",100,29290610,XCorr,5.0353432,1.0000000,,,,3.274999835412E-5,
TLHGLQNTETANVVPER,ph,T,882,true,"Sucrose-induced phosphorylation",24,17586839,,,,,,,,
TLHGLQNTETANVVPER,ph,T,882,true,"Plasmembrane Ph Immune Responses",25,17651370,,,,,,,,
TLHGLQNTETANVVPER,ph,T,882,true,"Phosphorylation nuclei-enriched fractions",28,19245862,,,,,,,,
TLHGLQNTETANVVPER,ph,T,882,true,"STN8 phosphoproteome",38,21768351,"MASCOT Score",81.7300000,,,,,,-1.9466800
TLHGLQNTETANVVPER,ph,T,882,true,"Chloroplast kinase substrates",60,19376835,"MASCOT Score",100.3900000,,,,,,-1.2425800
TLHGLQNTETANVVPER,ph,T,882,true,"atm and atr DNA damage response",88,25561503,"MASCOT Score",72.0000000,1.0000000,,,,,-0.1500000
TLHGLQNTETANVVPER,ph,T,882,true,"TOR Kinase and ABA Receptor",100,29290610,XCorr,4.7251658,1.0000000,,,,4.0199999773449E-8,
TLHGLQNTETANVVPER,ph,T,882,true,"Lateral root-induction - NAA vs control",106,23328941,"MASCOT Score",22.0000000,,,,,,
TLHGLQNTETANVVPER,ph,T,882,true,"Tissue atlas Arabidopsis - ProteomicsDB",114,32188942,"MaxQuant score",297.6300000,1.0000000,,,,0,
TLHGLQNTETANVVPER,ph,T,882,true,"Touch-induced phosphorylation: 40s touch vs untouc",136,30291188,"MASCOT score",103.7300000,,0.1067592,0.8885311,NO,,3.6420366
TLHGLQNTETANVVPER,ph,T,889,true,"Tissue atlas Arabidopsis - ProteomicsDB",114,32188942,"MaxQuant score",80.0020000,0.9401160,,,,0.00012879900168628,
ELSEIANQAK,ph,S,905,true,"Tissue atlas Arabidopsis - ProteomicsDB",114,32188942,"MaxQuant score",140.7800000,1.0000000,,,,4.2161700548604E-6,
ELSEIANQAKR,ac,K,912,true,"Quantitative Acetylproteomics",101,29440448,,,,,,,,
ELSEIANQAKR,ub,K,912,true,"Arabidopsis ubiquitination COFRADIC",40,26744219,"MaxQuant Score",56.4040000,1.0000000,,,,0.0080000003799796,0.5930000
LRELHTLK,ph,T,925,false,"TOR Kinase and ABA Receptor",100,29290610,XCorr,2.9754255,1.0000000,,,,0.013799999840558,
LRELHTLK,ph,T,925,false,"Tissue atlas Arabidopsis - ProteomicsDB",114,32188942,"MaxQuant score",96.7450000,1.0000000,,,,8.6063802882563E-5,
ELHTLKGHVESVVK,ub,K,927,false,"Ubiquitination Membrane Proteins",120,33585938,,,,,,,,
ELHTLKGHVESVVK,ub,K,927,false,"upl3 mutant / wildtype",168,35926874,"MaxQuant score",62.0880000,1.0000000,1.6229304,0.0344570,YES,0.00052185298409313,0.4810500
GHVESVVK,ph,S,932,false,"Pollen phosphoproteome Arabidopsis",43,22631563,"MASCOT Score",44.3900000,,,,,,-0.4803930
GHVESVVK,ph,S,932,false,"atm and atr DNA damage response",88,25561503,"MASCOT Score",35.0000000,1.0000000,,,,,-3.1400000
GHVESVVK,ph,S,932,false,"TOR Kinase and ABA Receptor",100,29290610,XCorr,2.6575863,1.0000000,,,,0.074850000441074,
GHVESVVK,ph,S,932,false,"Tissue atlas Arabidopsis - ProteomicsDB",114,32188942,"MaxQuant score",169.9300000,1.0000000,,,,0.00052241201046854,
GHVESVVKLK,ac,K,935,false,"Quantitative Acetylproteomics",101,29440448,,,,,,,,
GHVESVVKLK,ub,K,935,false,"Ubiquitination Membrane Proteins",120,33585938,,,,,,,,
GHVESVVKLK,ub,K,935,false,"upl3 mutant / wildtype",168,35926874,"MaxQuant score",159.8300000,1.0000000,0.6415460,0.4615400,NO,3.9782198655303E-6,-0.4116900
LKGLDIETAGHYTV,ub,K,937,true,"Ubiquitination Membrane Proteins",120,33585938,,,,,,,,
LKGLDIETAGHYTV,ub,K,937,true,"upl3 mutant / wildtype",168,35926874,"MaxQuant score",105.9500000,1.0000000,0.9686438,0.2328400,NO,2.0592100554495E-5,0.1754300
GLDIETAGHYTV,ph,T,943,true,"Tissue atlas Arabidopsis - ProteomicsDB",114,32188942,"MaxQuant score",141.1000000,0.9999770,,,,1.5523099136772E-5,
LKGLDIETAGHYTV,ph,T,948,true,"Phosphoproteome ethylene-regulated time response",46,24043427,"MASCOT Score",32.9600000,,,,,,7.7524000
LKGLDIETAGHYTV,ph,T,948,true,"Tissue atlas Arabidopsis - ProteomicsDB",114,32188942,"MaxQuant score",270.0700000,1.0000000,,,,0,
LKGLDIETAGHYTV,ph,T,948,true,"Touch-induced phosphorylation: 40s touch vs untouc",136,30291188,"MASCOT score",56.6900000,,-0.2026792,0.6429989,NO,,6.4930318
GLDIETAGHYTV,ph,T,948,true,"Plasmamembrane phosphorylation",20,15308754,,,,,,,,
GLDIETAGHYTV,ph,T,948,true,"srk2dei ABA signaling phopshoproteomics",83,23572148,"MASCOT Score",23.0000000,,,,,,-0.0009000
GLDIETAGHYTV,ph,T,948,true,"LAXIC - ABA stress",84a,23660473,XCorr,4.4400000,0.9980000,,,,0.0036378200165927,
GLDIETAGHYTV,ph,T,948,true,"SnRK2 protein kinase substrates",85,23776212,XCorr,2.3458610,0.9990000,,,,1.4159700185701E-6,
GLDIETAGHYTV,ph,T,948,true,"atm and atr DNA damage response",88,25561503,"MASCOT Score",58.0000000,0.9980000,,,,,-0.4100000
GLDIETAGHYTV,ph,T,948,true,"TOR Kinase and ABA Receptor",100,29290610,XCorr,4.2893424,0.9967000,,,,5.9270001656841E-5,
GLDIETAGHYTV,ph,T,948,true,"Phospho cell culture sucrose/TOR",109,30833711,,,0.9999700,,,,,
GLDIETAGHYTV,ph,T,948,true,"Touch-induced phosphorylation: 40s touch vs untouc",136,30291188,"MASCOT score",68.9100000,,0.0764874,0.8115493,NO,,3.2396124
