Peptide,PTM,ModifiedAA,ModifiedPosition,PeptideUniqueToGene,ExperimentDesc,ExpID,PubmedID,ScoreType,IdentScore,LocProb,Log2FChange,PQ-val,QuantSig,PEP,MassErrorPPM
SVSDISEVR,nt,S,171,false,"Arabidopsis translation initiation landscape - NT",167b,35069635,,,,,,,,
IYLSTPTK,ph,Y,215,true,"srk2dei ABA signaling phopshoproteomics",83,23572148,"MASCOT Score",21.0000000,,,,,,0.0015000
IYLSTPTK,ph,T,220,true,"srk2dei ABA signaling phopshoproteomics",83,23572148,"MASCOT Score",21.0000000,,,,,,0.0015000
TISDLGDEDYK,ph,S,257,true,"Tissue atlas Arabidopsis - ProteomicsDB",114,32188942,"MaxQuant score",130.5600000,0.9999980,,,,3.8331199903041E-6,
LELSAVPSSYSSGQLDPK,ph,S,298,true,"Large-scale phosphorylation discovery",44,23111157,XCorr,3.3550000,,,,,,
LELSAVPSSYSSGQLDPK,ph,S,298,true,"Lateral root-induction - NAA vs control",106,23328941,"MASCOT Score",38.0000000,,-0.1674336,0.3862541,NO,,
GRLELSAVPSSYSSGQLDPK,ph,S,299,true,"Conserved plant phosphoproteome - Arabidopsis",61a,20466843,"MASCOT Score",24.0000000,1.0000000,,,,,
GRLELSAVPSSYSSGQLDPK,ph,S,299,true,"srk2dei ABA signaling phopshoproteomics",83,23572148,"MASCOT Score",25.0000000,,,,,,-0.0013000
LELSAVPSSYSSGQLDPK,ph,S,299,true,"srk2dei ABA signaling phopshoproteomics",83,23572148,"MASCOT Score",39.0000000,,,,,,-0.0005000
LELSAVPSSYSSGQLDPK,ph,S,299,true,"Lateral root-induction - NAA vs control",106,23328941,"MASCOT Score",47.0000000,,,,,,
LELSAVPSSYSSGQLDPK,ph,Y,300,true,"srk2dei ABA signaling phopshoproteomics",83,23572148,"MASCOT Score",50.0000000,,,,,,-0.0003000
LELSAVPSSYSSGQLDPK,ph,Y,300,true,"Lateral root-induction - NAA vs control",106,23328941,"MASCOT Score",42.0000000,,,,,,
GRLELSAVPSSYSSGQLDPKK,ph,S,301,true,"srk2dei ABA signaling phopshoproteomics",83,23572148,"MASCOT Score",54.0000000,,,,,,-0.0007000
GRLELSAVPSSYSSGQLDPK,ph,S,301,true,"Large-scale phosphorylation discovery",44,23111157,XCorr,4.3060000,,,,,,
GRLELSAVPSSYSSGQLDPK,ph,S,301,true,"srk2dei ABA signaling phopshoproteomics",83,23572148,"MASCOT Score",61.0000000,,,,,,-0.0008000
GRLELSAVPSSYSSGQLDPK,ph,S,301,true,"Tissue atlas Arabidopsis - ProteomicsDB",114,32188942,"MaxQuant score",188.1900000,0.7820600,,,,7.286752014489E-44,
LELSAVPSSYSSGQLDPK,ph,S,301,true,"Large-scale phosphorylation discovery",44,23111157,XCorr,4.5890000,,,,,,
LELSAVPSSYSSGQLDPK,ph,S,301,true,"srk2dei ABA signaling phopshoproteomics",83,23572148,"MASCOT Score",65.0000000,,,,,,0.0003000
LELSAVPSSYSSGQLDPK,ph,S,301,true,"Lateral root-induction - NAA vs control",106,23328941,"MASCOT Score",40.0000000,,,,,,
GRLELSAVPSSYSSGQLDPKK,ph,S,302,true,"srk2dei ABA signaling phopshoproteomics",83,23572148,"MASCOT Score",71.0000000,,,,,,-0.0001000
GRLELSAVPSSYSSGQLDPKK,ph,S,302,true,"Brassinosteroid-Regulated Phosphorylation Dynamics",94,26187819,"MaxQuant Score",100.0800000,0.9840000,,,,0.0001648000034038,2.7130000
GRLELSAVPSSYSSGQLDPKK,ph,S,302,true,"TOR Kinase and ABA Receptor",100,29290610,XCorr,4.1948557,0.9042000,,,,4.366999917238E-7,
GRLELSAVPSSYSSGQLDPK,ph,S,302,true,"ABA-induced protein phosphorylation",35,20733066,,,,,,,,
GRLELSAVPSSYSSGQLDPK,ph,S,302,true,"PAMP-triggered phosphorylation",48,24601666,"MASCOT Score",79.3800000,,,,,,
GRLELSAVPSSYSSGQLDPK,ph,S,302,true,"srk2dei ABA signaling phopshoproteomics",83,23572148,"MASCOT Score",93.0000000,,,,,,-0.0002000
GRLELSAVPSSYSSGQLDPK,ph,S,302,true,"SnRK2 protein kinase substrates",85,23776212,XCorr,3.9869299,0.9350000,,,,0.0016393200494349,
GRLELSAVPSSYSSGQLDPK,ph,S,302,true,"TOR Kinase and ABA Receptor",100,29290610,XCorr,5.0545125,0.8990000,,,,0.00064749998273328,
GRLELSAVPSSYSSGQLDPK,ph,S,302,true,"Col-0 callus - FC Col-0 vs. Col-0 Xray",111a,31410901,,46.9000000,,0.7031142,0.0000000,NO,,0.4908653
GRLELSAVPSSYSSGQLDPK,ph,S,302,true,"Col-0 X-ray callus - FC Col-0 vs. Col-0 Xray",111b,31410901,,46.9000000,,0.7031142,0.0000000,NO,,0.4908653
GRLELSAVPSSYSSGQLDPK,ph,S,302,true,"atm callus - FC atm vs. atm Xray",111c,31410901,,46.9000000,,0.8587918,0.0000000,NO,,0.4908653
GRLELSAVPSSYSSGQLDPK,ph,S,302,true,"atm-3 X-ray callus - FC atm vs. atm Xray",111d,31410901,,46.9000000,,0.8587918,0.0000000,NO,,0.4908653
GRLELSAVPSSYSSGQLDPK,ph,S,302,true,"Tissue atlas Arabidopsis - ProteomicsDB",114,32188942,"MaxQuant score",239.1000000,0.9908790,,,,0,
LELSAVPSSYSSGQLDPK,ph,S,302,true,"Large-scale phosphorylation discovery",44,23111157,XCorr,4.8150000,,,,,,
LELSAVPSSYSSGQLDPK,ph,S,302,true,"PAMP-triggered phosphorylation",48,24601666,"MASCOT Score",34.7900000,,,,,,
LELSAVPSSYSSGQLDPK,ph,S,302,true,"Tyrosine phosphorylation in Arabidopsis",59,18463617,"MASCOT Score",32.0000000,,,,,,-0.8687181
LELSAVPSSYSSGQLDPK,ph,S,302,true,"Conserved plant phosphoproteome - Arabidopsis",61a,20466843,"MASCOT Score",28.0000000,1.0000000,,,,,
LELSAVPSSYSSGQLDPK,ph,S,302,true,"srk2dei ABA signaling phopshoproteomics",83,23572148,"MASCOT Score",56.0000000,,,,,,-0.0003000
LELSAVPSSYSSGQLDPK,ph,S,302,true,"LAXIC - ABA stress",84a,23660473,XCorr,4.0300000,0.9970000,,,,5.5500000151198E-9,
LELSAVPSSYSSGQLDPK,ph,S,302,true,"LAXIC - mannitol vs control",84b,23660473,XCorr,3.4600000,0.9410000,-1.2590341,,NO,6.5099996504614E-8,
LELSAVPSSYSSGQLDPK,ph,S,302,true,"SnRK2 protein kinase substrates",85,23776212,XCorr,3.5625091,0.9990000,,,,8.524650183972E-5,
LELSAVPSSYSSGQLDPK,ph,S,302,true,"Lateral root-induction - NAA vs control",106,23328941,"MASCOT Score",41.0000000,,,,,,
LELSAVPSSYSSGQLDPK,ph,S,302,true,"Phospho cell culture sucrose/TOR",109,30833711,,,0.8933990,,,,,
LELSAVPSSYSSGQLDPK,ph,S,302,true,"Col-0 callus - FC Col-0 vs. Col-0 Xray",111a,31410901,,68.0700000,,0.5301908,0.0000000,NO,,0.3475360
LELSAVPSSYSSGQLDPK,ph,S,302,true,"Col-0 X-ray callus - FC Col-0 vs. Col-0 Xray",111b,31410901,,68.0700000,,0.5301908,0.0000000,NO,,0.3475360
LELSAVPSSYSSGQLDPK,ph,S,302,true,"atm callus - FC atm vs. atm Xray",111c,31410901,,68.0700000,,1.1511702,0.0000000,NO,,0.3475360
LELSAVPSSYSSGQLDPK,ph,S,302,true,"atm-3 X-ray callus - FC atm vs. atm Xray",111d,31410901,,68.0700000,,1.1511702,0.0000000,NO,,0.3475360
