Peptide,PTM,ModifiedAA,ModifiedPosition,PeptideUniqueToGene,ExperimentDesc,ExpID,PubmedID,ScoreType,IdentScore,LocProb,Log2FChange,PQ-val,QuantSig,PEP,MassErrorPPM
GVFSFVCKSKGGEWTAKQHEGDLEASASSTYDLQR,nt,G,2,true,"FtsH12 N-terminome: WT / FtsH12 knockdown miRNA",118,33216923,"MaxQuant score",76.7590000,,,,,0.021384000778198,
GVFSFVCKSKGGEWTAKQHEGDLEASASSTYDLQR,nt,G,2,true,"HUNTER N-terminome: legumain, GluC and trypsin",119,31951383,"MaxQuant score",69.4890000,,,,,,
GVFSFVCKSKGGEWTAKQHEG,nt,G,2,true,"Arabidopsis translation initiation landscape - NT",167b,35069635,,,,,,,,
GVFSFVCKSKGGE,nt,G,2,true,"HUNTER N-terminome: legumain, GluC and trypsin",119,31951383,"MaxQuant score",96.1350000,,,,,,
GVFSFVCK,acy,C,8,true,"Arabidopsis S-acylation atlas - Leaf",163c,35681017,,,,,,,,
GVFSFVCK,acy,C,8,true,"Arabidopsis S-acylation atlas - Seedling",163d,35681017,,,,,,,,
GVFSFVCKSK,so,C,8,true,"S-sulfenylation site detection using YAP1C",110,32714340,,,,,,,,
SKGGEWTAK,ub,K,11,true,"upl3 mutant / wildtype",168,35926874,"MaxQuant score",85.3550000,1.0000000,0.1110313,0.9268800,NO,0.008439370431006,1.0648000
AGGGAAAGGGGGGE,nt,A,79,true,"Arg/N-end rule seed, prt6 vs. Wt",99,29168982,"MASCOT Score",104.5900000,,-0.2397052,0.1468512,NO,9.5700003477361E-10,-0.2881371
KKEESEEEEGDFGFDLFG,ph,S,107,false,"Arabidopsis root NAA phosphoproteome",18a,27643528,"MaxQuant Score",218.6900000,1.0000000,,,,1.6815581571898E-43,0.0560000
KKEESEEEEGDFGFDLFG,ph,S,107,false,"Phosphorylation Early Elicitor Signaling",23,17317660,,,,,,,,
KKEESEEEEGDFGFDLFG,ph,S,107,false,"Phosphorylation nuclei-enriched fractions",28,19245862,,,,,,,,
KKEESEEEEGDFGFDLFG,ph,S,107,false,"Nitrogen deprivation Ph response",39,22329444,,,,,,,,
KKEESEEEEGDFGFDLFG,ph,S,107,false,"Phosphoproteome iron-deficient Arabidopsis roots",41,22438062,"MASCOT Score",55.3000000,,,,,,
KKEESEEEEGDFGFDLFG,ph,S,107,false,"Phosphoproteomic analysis of seed maturation",42,22440515,"MASCOT Score",62.0000000,,,,,,-2.3300000
KKEESEEEEGDFGFDLFG,ph,S,107,false,"Large-scale phosphorylation discovery",44,23111157,XCorr,3.2870000,,,,,,
KKEESEEEEGDFGFDLFG,ph,S,107,false,"MAPK Arabidopsis substrates",45,23172892,"MaxQuant Score",230.9700000,,,,,,
KKEESEEEEGDFGFDLFG,ph,S,107,false,"PAMP-triggered phosphorylation",48,24601666,"MASCOT Score",78.3200000,,,,,,
KKEESEEEEGDFGFDLFG,ph,S,107,false,"Tyrosine phosphorylation in Arabidopsis",59,18463617,"MASCOT Score",70.0000000,,,,,,-1.1516176
KKEESEEEEGDFGFDLFG,ph,S,107,false,"BSK8 and BSL2 regulating sucrose-ph synthase",66,24924143,"MaxQuant Score",249.2000000,,,,,,-0.7976000
KKEESEEEEGDFGFDLFG,ph,S,107,false,"srk2dei ABA signaling phopshoproteomics",83,23572148,"MASCOT Score",88.0000000,,,,,,-0.0017000
KKEESEEEEGDFGFDLFG,ph,S,107,false,"LAXIC - mannitol vs control",84b,23660473,XCorr,4.6700000,1.0000000,-1.2373923,,NO,4.1800001273948E-16,
KKEESEEEEGDFGFDLFG,ph,S,107,false,"SnRK2 protein kinase substrates",85,23776212,XCorr,5.1988273,1.0000000,,,,1.0330100490286E-12,
KKEESEEEEGDFGFDLFG,ph,S,107,false,"SIRK1 phosphorylation",86a,23820729,"MaxQuant Score",188.6300000,1.0000000,,,,1.0900000013692E-8,3.6040000
KKEESEEEEGDFGFDLFG,ph,S,107,false,"SIRK1 exp - sirk1 mutant vs WT",86b,23820729,,,,-1.0532941,,NO,,
KKEESEEEEGDFGFDLFG,ph,S,107,false,"SIRK1 exp - 35S:SIRK1 vs WT",86c,23820729,,,,-0.4448056,,NO,,
KKEESEEEEGDFGFDLFG,ph,S,107,false,"atm and atr DNA damage response",88,25561503,"MASCOT Score",26.0000000,1.0000000,,,,,-0.5600000
KKEESEEEEGDFGFDLFG,ph,S,107,false,"Brassinosteroid-Regulated Phosphorylation Dynamics",94,26187819,"MaxQuant Score",160.3000000,1.0000000,,,,2.8639998705948E-10,4.0550000
KKEESEEEEGDFGFDLFG,ph,S,107,false,"Phospho cell culture sucrose/TOR",109,30833711,,,1.0000000,,,,,
KKEESEEEEGDFGFDLFG,ph,S,107,false,"Tissue atlas Arabidopsis - ProteomicsDB",114,32188942,"MaxQuant score",370.3800000,1.0000000,,,,0,
KKEESEEEEGDFGFDLFG,ph,S,107,false,"Touch-induced phosphorylation: 40s touch vs untouc",136,30291188,"MASCOT score",97.4700000,,-0.1347382,0.3800267,NO,,4.7065192
KEESEEEEGDFGFDLFG,ph,S,107,false,"Phosphorylation Early Elicitor Signaling",23,17317660,,,,,,,,
KEESEEEEGDFGFDLFG,ph,S,107,false,"Cytosolic ribosome Ph",26,17934214,,,,,,,,
KEESEEEEGDFGFDLFG,ph,S,107,false,"Phosphorylation nuclei-enriched fractions",28,19245862,,,,,,,,
KEESEEEEGDFGFDLFG,ph,S,107,false,"Nitrogen deprivation Ph response",39,22329444,,,,,,,,
KEESEEEEGDFGFDLFG,ph,S,107,false,"Phosphoproteome iron-deficient Arabidopsis roots",41,22438062,"MASCOT Score",66.8300000,,,,,,
KEESEEEEGDFGFDLFG,ph,S,107,false,"Phosphoproteomic analysis of seed maturation",42,22440515,"MASCOT Score",56.0000000,,,,,,-0.8100000
KEESEEEEGDFGFDLFG,ph,S,107,false,"Pollen phosphoproteome Arabidopsis",43,22631563,"MASCOT Score",76.1300000,,,,,,-2.5716100
KEESEEEEGDFGFDLFG,ph,S,107,false,"Tyrosine phosphorylation in Arabidopsis",59,18463617,"MASCOT Score",41.0000000,,,,,,-0.5874389
KEESEEEEGDFGFDLFG,ph,S,107,false,"srk2dei ABA signaling phopshoproteomics",83,23572148,"MASCOT Score",71.0000000,,,,,,0.0008000
KEESEEEEGDFGFDLFG,ph,S,107,false,"LAXIC - ABA stress",84a,23660473,XCorr,3.3700000,1.0000000,,,,0.14610999822617,
KEESEEEEGDFGFDLFG,ph,S,107,false,"LAXIC - mannitol vs control",84b,23660473,XCorr,4.6800000,1.0000000,,,,5.2600000743919E-11,
KEESEEEEGDFGFDLFG,ph,S,107,false,"SnRK2 protein kinase substrates",85,23776212,XCorr,4.8018436,1.0000000,,,,0.00035442100488581,
KEESEEEEGDFGFDLFG,ph,S,107,false,"TOR Kinase and ABA Receptor",100,29290610,XCorr,5.5228648,1.0000000,,,,1.3189999492624E-7,
KEESEEEEGDFGFDLFG,ph,S,107,false,"Col-0 callus - FC Col-0 vs. Col-0 Xray",111a,31410901,,24.7500000,,0.3800896,0.0000000,NO,,0.5994562
KEESEEEEGDFGFDLFG,ph,S,107,false,"Col-0 X-ray callus - FC Col-0 vs. Col-0 Xray",111b,31410901,,24.7500000,,0.3800896,0.0000000,NO,,0.5994562
KEESEEEEGDFGFDLFG,ph,S,107,false,"atm callus - FC atm vs. atm Xray",111c,31410901,,24.7500000,,0.6637351,0.0000000,NO,,0.5994562
KEESEEEEGDFGFDLFG,ph,S,107,false,"atm-3 X-ray callus - FC atm vs. atm Xray",111d,31410901,,24.7500000,,0.6637351,0.0000000,NO,,0.5994562
KEESEEEEGDFGFDLFG,ph,S,107,false,"Touch-induced phosphorylation: 40s touch vs untouc",136,30291188,"MASCOT score",101.3500000,,-0.1433736,0.6118080,NO,,-0.3184047
EESEEEEGDFGFDLFG,ph,S,107,false,"Cytosolic ribosome Ph",26,17934214,,,,,,,,
EESEEEEGDFGFDLFG,ph,S,107,false,"srk2dei ABA signaling phopshoproteomics",83,23572148,"MASCOT Score",63.0000000,,,,,,0.0005000
EESEEEEGDFGFDLFG,ph,S,107,false,"SnRK2 protein kinase substrates",85,23776212,XCorr,4.6864061,1.0000000,,,,5.3493602081289E-7,
EESEEEEGDFGFDLFG,ph,S,107,false,"TOR Kinase and ABA Receptor",100,29290610,XCorr,5.4334211,1.0000000,,,,1.1629999789875E-6,
