Peptide,PTM,ModifiedAA,ModifiedPosition,PeptideUniqueToGene,ExperimentDesc,ExpID,PubmedID,ScoreType,IdentScore,LocProb,Log2FChange,PQ-val,QuantSig,PEP,MassErrorPPM
ISGDETEESDASEEKVSTR,ph,T,991,true,"LAXIC - mannitol vs control",84b,23660473,XCorr,2.4000000,0.8020000,,,,0.0084742102771997,
ISGDETEESDASEEK,ph,T,991,true,"atm and atr DNA damage response",88,25561503,"MASCOT Score",25.0000000,1.0000000,,,,,-0.1700000
ISGDETEESDASEEKVSTR,ph,S,994,true,"Tissue atlas Arabidopsis - ProteomicsDB",114,32188942,"MaxQuant score",164.7400000,1.0000000,,,,4.2360801355743E-33,
ISGDETEESDASEEK,ph,S,994,true,"SnRK2 protein kinase substrates",85,23776212,XCorr,4.7535229,1.0000000,,,,0.0051658200100064,
ISGDETEESDASEEK,ph,S,994,true,"atm and atr DNA damage response",88,25561503,"MASCOT Score",81.0000000,1.0000000,,,,,-0.3100000
ISGDETEESDASEEKVSTR,ph,S,997,true,"LAXIC - mannitol vs control",84b,23660473,XCorr,2.4000000,0.8720000,,,,0.0084742102771997,
ISGDETEESDASEEKVSTR,ph,S,997,true,"SnRK2 protein kinase substrates",85,23776212,XCorr,2.6705115,0.9770000,,,,0.01466070022434,
ISGDETEESDASEEK,ph,S,997,true,"atm and atr DNA damage response",88,25561503,"MASCOT Score",81.0000000,1.0000000,,,,,-0.3100000
ISGDETEESDASEEK,ph,S,997,true,"Tissue atlas Arabidopsis - ProteomicsDB",114,32188942,"MaxQuant score",164.7400000,1.0000000,,,,4.2360801355743E-33,
LSDIAEETDSFGEAQR,ph,S,1006,true,"Tissue atlas Arabidopsis - ProteomicsDB",114,32188942,"MaxQuant score",155.7300000,0.9999770,,,,3.1563099884325E-29,
LSDIAEETDSFGEAQR,ph,T,1012,true,"Tissue atlas Arabidopsis - ProteomicsDB",114,32188942,"MaxQuant score",105.0000000,0.9189440,,,,5.5880400395836E-6,
LSDIAEETDSFGEAQR,ph,S,1014,true,"Tissue atlas Arabidopsis - ProteomicsDB",114,32188942,"MaxQuant score",239.5500000,0.9995310,,,,0,
IGGDESDENDELDGNNNVSADAEEGNAAGR,ph,S,1058,true,"STN8 phosphoproteome",38,21768351,"MASCOT Score",103.0800000,,,,,,-1.8210900
IGGDESDENDELDGNNNVSADAEEGNAAGR,ph,S,1058,true,"srk2dei ABA signaling phopshoproteomics",83,23572148,"MASCOT Score",32.0000000,,,,,,0.0014000
IGGDESDENDELDGNNNVSADAEEGNAAGR,ph,S,1058,true,"LAXIC - ABA stress",84a,23660473,XCorr,6.1500000,0.9990000,,,,0.00015822300338186,
IGGDESDENDELDGNNNVSADAEEGNAAGR,ph,S,1058,true,"LAXIC - mannitol vs control",84b,23660473,XCorr,5.5800000,1.0000000,,,,0.0014559599803761,
IGGDESDENDELDGNNNVSADAEEGNAAGR,ph,S,1058,true,"SnRK2 protein kinase substrates",85,23776212,XCorr,5.8229308,1.0000000,,,,4.232220043171E-12,
IGGDESDENDELDGNNNVSADAEEGNAAGR,ph,S,1058,true,"TOR Kinase and ABA Receptor",100,29290610,XCorr,6.9994512,1.0000000,,,,2.689000133671E-10,
IGGDESDENDELDGNNNVSADAEEGNAAGR,ph,S,1058,true,"Lateral root-induction - NAA vs control",106,23328941,"MASCOT Score",51.0000000,,,,,,
IGGDESDENDELDGNNNVSADAEEGNAAGR,ph,S,1058,true,"Col-0 callus - FC Col-0 vs. Col-0 Xray",111a,31410901,,44.9600000,,0.3211746,0.0000000,NO,,1.5566134
IGGDESDENDELDGNNNVSADAEEGNAAGR,ph,S,1058,true,"Col-0 X-ray callus - FC Col-0 vs. Col-0 Xray",111b,31410901,,44.9600000,,0.3211746,0.0000000,NO,,1.5566134
IGGDESDENDELDGNNNVSADAEEGNAAGR,ph,S,1058,true,"atm callus - FC atm vs. atm Xray",111c,31410901,,44.9600000,,0.0961511,0.0000000,NO,,1.5566134
IGGDESDENDELDGNNNVSADAEEGNAAGR,ph,S,1058,true,"atm-3 X-ray callus - FC atm vs. atm Xray",111d,31410901,,44.9600000,,0.0961511,0.0000000,NO,,1.5566134
SVENEETREPDIAK,ph,S,1083,true,"Tissue atlas Arabidopsis - ProteomicsDB",114,32188942,"MaxQuant score",91.5180000,0.9999870,,,,0.00040579200140201,
