Peptide,PTM,ModifiedAA,ModifiedPosition,PeptideUniqueToGene,ExperimentDesc,ExpID,PubmedID,ScoreType,IdentScore,LocProb,Log2FChange,PQ-val,QuantSig,PEP,MassErrorPPM
TSLLKSSPGR,ph,S,3,true,"SIRK1 phosphorylation",86a,23820729,"MaxQuant Score",43.1330000,0.7620000,,,,1.1840000152588,3.7230000
TSLLKSSPGR,ph,S,7,true,"SIRK1 phosphorylation",86a,23820729,"MaxQuant Score",131.8800000,0.9300000,,,,0.0099999997764826,8.1060000
TSLLKSSPGR,ph,S,7,true,"Tissue atlas Arabidopsis - ProteomicsDB",114,32188942,"MaxQuant score",124.1200000,0.8312140,,,,2.1814399588038E-5,
TSLLKSSPGR,ph,S,8,true,"SIRK1 phosphorylation",86a,23820729,"MaxQuant Score",106.2100000,0.8090000,,,,0.052999999374151,6.4550000
TSLLKSSPGR,ph,S,8,true,"SIRK1 exp - sirk1 mutant vs WT",86b,23820729,,,,-2.1020762,,NO,,
TSLLKSSPGR,ph,S,8,true,"SIRK1 exp - 35S:SIRK1 vs WT",86c,23820729,,,,-1.1914756,,NO,,
TSLLKSSPGR,ph,S,8,true,"Tissue atlas Arabidopsis - ProteomicsDB",114,32188942,"MaxQuant score",190.8500000,0.9951900,,,,3.4013400819835E-14,
RGGDVESGKSEHADSDSDTFYIPSK,ph,S,19,true,"TOR Kinase and ABA Receptor",100,29290610,XCorr,4.7435527,0.9633000,,,,0.0021180000621825,
RGGDVESGKSEHADSDSDTFYIPSK,ph,S,19,true,"Tissue atlas Arabidopsis - ProteomicsDB",114,32188942,"MaxQuant score",175.0600000,0.9860190,,,,0,
GGDVESGKSEHADSDSDTFYIPSK,ph,S,19,true,"Plasmamembrane phosphorylation",20,15308754,,,,,,,,
GGDVESGKSEHADSDSDTFYIPSK,ph,S,19,true,"Conserved plant phosphoproteome - Arabidopsis",61a,20466843,"MASCOT Score",27.0000000,1.0000000,,,,,
RGGDVESGKSEHADSDSDTFYIPSK,ph,S,22,true,"TOR Kinase and ABA Receptor",100,29290610,XCorr,4.7435527,0.8393000,,,,0.0021180000621825,
GGDVESGKSEHADSDSDTFYIPSK,ph,S,22,true,"Plasmamembrane phosphorylation",20,15308754,,,,,,,,
GGDVESGKSEHADSDSDTFYIPSK,ph,S,22,true,"Brassinosteroid-Regulated Phosphorylation Dynamics",94,26187819,"MaxQuant Score",113.7200000,0.7810000,,,,0.0020000000949949,-5.4180000
GGDVESGKSEHADSDSDTFYIPSK,ph,S,22,true,"Tissue atlas Arabidopsis - ProteomicsDB",114,32188942,"MaxQuant score",341.4000000,0.9999160,,,,0,
SEHADSDSDTFYIPSK,ph,S,22,true,"Sucrose-induced phosphorylation",24,17586839,,,,,,,,
SEHADSDSDTFYIPSK,ph,S,22,true,"Tyrosine phosphorylation in Arabidopsis",59,18463617,"MASCOT Score",50.0000000,,,,,,-0.4793009
SEHADSDSDTFYIPSK,ph,S,22,true,"srk2dei ABA signaling phopshoproteomics",83,23572148,"MASCOT Score",26.0000000,,,,,,-0.0007000
RGGDVESGKSEHADSDSDTFYIPSK,ph,S,27,true,"Plasmamembrane phosphorylation",20,15308754,,,,,,,,
GGDVESGKSEHADSDSDTFYIPSK,ph,S,27,true,"Plasmamembrane phosphorylation",20,15308754,,,,,,,,
GGDVESGKSEHADSDSDTFYIPSK,ph,S,27,true,"Phosphorylation Early Elicitor Signaling",23,17317660,,,,,,,,
GGDVESGKSEHADSDSDTFYIPSK,ph,S,27,true,"SnRK2 protein kinase substrates",85,23776212,XCorr,4.3407230,0.9730000,,,,7.619090081068E-11,
GGDVESGKSEHADSDSDTFYIPSK,ph,S,27,true,"Col-0 callus - FC Col-0 vs. Col-0 Xray",111a,31410901,,49.6000000,,0.2957385,0.0000000,NO,,1.1531199
GGDVESGKSEHADSDSDTFYIPSK,ph,S,27,true,"Col-0 X-ray callus - FC Col-0 vs. Col-0 Xray",111b,31410901,,49.6000000,,0.2957385,0.0000000,NO,,1.1531199
GGDVESGKSEHADSDSDTFYIPSK,ph,S,27,true,"atm callus - FC atm vs. atm Xray",111c,31410901,,49.6000000,,0.3396050,0.0000000,NO,,1.1531199
GGDVESGKSEHADSDSDTFYIPSK,ph,S,27,true,"atm-3 X-ray callus - FC atm vs. atm Xray",111d,31410901,,49.6000000,,0.3396050,0.0000000,NO,,1.1531199
SEHADSDSDTFYIPSK,ph,S,27,true,"Arabidopsis root NAA phosphoproteome",18a,27643528,"MaxQuant Score",87.6760000,0.9390000,,,,7.9199997671253E-9,0.5000000
SEHADSDSDTFYIPSK,ph,S,27,true,"Plasmamembrane phosphorylation",20,15308754,,,,,,,,
SEHADSDSDTFYIPSK,ph,S,27,true,"Plasmembrane Ph Immune Responses",25,17651370,,,,,,,,
SEHADSDSDTFYIPSK,ph,S,27,true,"Phytohormone-responsive phosphoproteins",34,20374526,"MASCOT Score",85.0000000,,,,,,
SEHADSDSDTFYIPSK,ph,S,27,true,"STN8 phosphoproteome",38,21768351,"MASCOT Score",51.1000000,,,,,,-0.9231980
SEHADSDSDTFYIPSK,ph,S,27,true,"Tyrosine phosphorylation in Arabidopsis",59,18463617,"MASCOT Score",67.0000000,,,,,,-1.0651138
SEHADSDSDTFYIPSK,ph,S,27,true,"Chloroplast kinase substrates",60,19376835,"MASCOT Score",43.5300000,,,,,,-0.8487200
SEHADSDSDTFYIPSK,ph,S,27,true,"Conserved plant phosphoproteome - Arabidopsis",61a,20466843,"MASCOT Score",50.0000000,1.0000000,,,,,
SEHADSDSDTFYIPSK,ph,S,27,true,"srk2dei ABA signaling phopshoproteomics",83,23572148,"MASCOT Score",53.0000000,,,,,,-0.0012000
SEHADSDSDTFYIPSK,ph,S,27,true,"LAXIC - ABA stress",84a,23660473,XCorr,4.6600000,1.0000000,,,,0.00010315099643776,
SEHADSDSDTFYIPSK,ph,S,27,true,"LAXIC - mannitol vs control",84b,23660473,XCorr,4.0400000,0.9990000,-1.5225115,,NO,4.6699998534905E-8,
SEHADSDSDTFYIPSK,ph,S,27,true,"SnRK2 protein kinase substrates",85,23776212,XCorr,4.2348132,1.0000000,,,,2.6075800633407E-5,
SEHADSDSDTFYIPSK,ph,S,27,true,"atm and atr DNA damage response",88,25561503,"MASCOT Score",55.0000000,0.9970000,,,,,-0.7400000
SEHADSDSDTFYIPSK,ph,S,27,true,"Brassinosteroid-Regulated Phosphorylation Dynamics",94,26187819,"MaxQuant Score",123.0000000,0.9980000,,,,3.1100000796869E-8,0.9790000
SEHADSDSDTFYIPSK,ph,S,27,true,"TOR Kinase and ABA Receptor",100,29290610,XCorr,3.5589697,0.9971000,,,,0.001196000026539,
SEHADSDSDTFYIPSK,ph,S,27,true,"Lateral root-induction - NAA vs control",106,23328941,"MASCOT Score",53.0000000,,,,,,
SEHADSDSDTFYIPSK,ph,S,27,true,"Phosphorylation tonoplast membrane fraction",107,18686298,"MASCOT Score",70.0000000,,,,,,
SEHADSDSDTFYIPSK,ph,S,27,true,"Phospho cell culture sucrose/TOR",109,30833711,,,0.9997240,,,,,
SEHADSDSDTFYIPSK,ph,S,27,true,"Col-0 callus - FC Col-0 vs. Col-0 Xray",111a,31410901,,59.2200000,,0.2318428,0.0000000,NO,,1.2633343
SEHADSDSDTFYIPSK,ph,S,27,true,"Col-0 X-ray callus - FC Col-0 vs. Col-0 Xray",111b,31410901,,59.2200000,,0.2318428,0.0000000,NO,,1.2633343
SEHADSDSDTFYIPSK,ph,S,27,true,"atm callus - FC atm vs. atm Xray",111c,31410901,,59.2200000,,0.5450518,0.0000000,NO,,1.2633343
SEHADSDSDTFYIPSK,ph,S,27,true,"atm-3 X-ray callus - FC atm vs. atm Xray",111d,31410901,,59.2200000,,0.5450518,0.0000000,NO,,1.2633343
SEHADSDSDTFYIPSK,ph,S,27,true,"Tissue atlas Arabidopsis - ProteomicsDB",114,32188942,"MaxQuant score",361.2200000,0.9999980,,,,0,
GGDVESGKSEHADSDSDTFYIPSK,ph,S,29,true,"Plasmamembrane phosphorylation",20,15308754,,,,,,,,
GGDVESGKSEHADSDSDTFYIPSK,ph,S,29,true,"Phytohormone-responsive phosphoproteins",34,20374526,"MASCOT Score",50.0000000,,,,,,
SEHADSDSDTFYIPSK,ph,S,29,true,"Tyrosine phosphorylation in Arabidopsis",59,18463617,"MASCOT Score",49.0000000,,,,,,-0.1597669
SEHADSDSDTFYIPSK,ph,S,29,true,"atm and atr DNA damage response",88,25561503,"MASCOT Score",38.0000000,0.9950000,,,,,-1.4500000
SEHADSDSDTFYIPSK,ph,S,29,true,"TOR Kinase and ABA Receptor",100,29290610,XCorr,3.5589697,0.8843000,,,,0.001196000026539,
SEHADSDSDTFYIPSK,ph,S,29,true,"Lateral root-induction - NAA vs control",106,23328941,"MASCOT Score",26.0000000,,,,,,
SEHADSDSDTFYIPSK,ph,S,29,true,"Col-0 callus - FC Col-0 vs. Col-0 Xray",111a,31410901,,36.5500000,,0.0367936,0.0000000,NO,,0.2134783
SEHADSDSDTFYIPSK,ph,S,29,true,"Col-0 X-ray callus - FC Col-0 vs. Col-0 Xray",111b,31410901,,36.5500000,,0.0367936,0.0000000,NO,,0.2134783
SEHADSDSDTFYIPSK,ph,S,29,true,"atm callus - FC atm vs. atm Xray",111c,31410901,,36.5500000,,-0.2395947,0.0000000,NO,,0.2134783
SEHADSDSDTFYIPSK,ph,S,29,true,"atm-3 X-ray callus - FC atm vs. atm Xray",111d,31410901,,36.5500000,,-0.2395947,0.0000000,NO,,0.2134783
SEHADSDSDTFYIPSK,ph,S,29,true,"Tissue atlas Arabidopsis - ProteomicsDB",114,32188942,"MaxQuant score",245.9700000,0.9998700,,,,0,
SEHADSDSDTFYIPSK,ph,T,31,true,"atm and atr DNA damage response",88,25561503,"MASCOT Score",29.0000000,0.9960000,,,,,0.1200000
SEHADSDSDTFYIPSK,ph,T,31,true,"Tissue atlas Arabidopsis - ProteomicsDB",114,32188942,"MaxQuant score",212.7200000,0.9998530,,,,0,
AALVLNASRR,ph,S,57,false,"Arabidopsis root NAA phosphoproteome",18a,27643528,"MaxQuant Score",44.5430000,1.0000000,,,,0.0020000000949949,-2.9780000
AALVLNASRR,ph,S,57,false,"atm and atr DNA damage response",88,25561503,"MASCOT Score",53.0000000,1.0000000,,,,,0.1900000
AALVLNASRR,ph,S,57,false,"TOR Kinase and ABA Receptor",100,29290610,XCorr,2.2182567,1.0000000,,,,0.010470000095665,
KAALVLNASR,ph,S,57,true,"atm and atr DNA damage response",88,25561503,"MASCOT Score",52.0000000,1.0000000,,,,,-0.9300000
KAALVLNASR,ph,S,57,true,"Tissue atlas Arabidopsis - ProteomicsDB",114,32188942,"MaxQuant score",149.9600000,1.0000000,,,,6.3531797422911E-7,
AALVLNASR,ph,S,57,false,"STN8 phosphoproteome",38,21768351,"MASCOT Score",41.3100000,,,,,,0.7821250
AALVLNASR,ph,S,57,false,"Large-scale phosphorylation discovery",44,23111157,XCorr,3.1530000,,,,,,
AALVLNASR,ph,S,57,false,"Tyrosine phosphorylation in Arabidopsis",59,18463617,"MASCOT Score",38.0000000,,,,,,-1.5098149
AALVLNASR,ph,S,57,false,"atm and atr DNA damage response",88,25561503,"MASCOT Score",59.0000000,1.0000000,,,,,0.4700000
AALVLNASR,ph,S,57,false,"TOR Kinase and ABA Receptor",100,29290610,XCorr,3.1026218,1.0000000,,,,0.0073910001665354,
FRYTLDLKK,ph,T,63,true,"Tissue atlas Arabidopsis - ProteomicsDB",114,32188942,"MaxQuant score",90.6970000,0.9999450,,,,0.0013323900057003,
FRYTLDLK,ph,T,63,false,"atm and atr DNA damage response",88,25561503,"MASCOT Score",25.0000000,0.9970000,,,,,-1.4900000
FRYTLDLK,ph,T,63,false,"Tissue atlas Arabidopsis - ProteomicsDB",114,32188942,"MaxQuant score",82.2610000,0.9995750,,,,0.0038450299762189,
FMDMGRESGVEK,ph,S,99,true,"Phosphorylation Early Elicitor Signaling",23,17317660,,,,,,,,
FMDMGRESGVEK,ph,S,99,true,"Tissue atlas Arabidopsis - ProteomicsDB",114,32188942,"MaxQuant score",96.1350000,1.0000000,,,,0.00030024399165995,
ESGVEKTTGPATPAGDFGITPEQLVIMSK,ph,S,125,true,"Large-scale phosphorylation discovery",44,23111157,XCorr,2.8610000,,,,,,
GISGDDDDLLKR,ac,K,163,true,"Quantitative Acetylproteomics",101,29440448,,,,,,,,
QSLQFQNLNDEKR,ac,K,253,false,"Quantitative Acetylproteomics",101,29440448,,,,,,,,
DNNGGPQFVKGK,ac,K,411,true,"Quantitative Acetylproteomics",101,29440448,,,,,,,,
MMADKALVR,me2,K,461,false,"Arabidopsis protein methylome",123,31809900,"MaxQuant Score",89.6980000,1.0000000,,,,0.005010989960283,4.1699000
LSACETMGSATTICSDK,sno,C,470,false,"hot5-4 / wildtype, FAT-switch S-nitrosoproteome",169,37277371,,,,,,,,
ASFFKNGINDMAGR,ac,K,630,true,"Quantitative Acetylproteomics",101,29440448,,,,,,,,
TYEAEKVPTGEELSK,ub,K,655,true,"upl3 mutant / wildtype",168,35926874,"MaxQuant score",95.2360000,1.0000000,-0.9461936,0.2130800,NO,6.2140197769622E-6,-0.5846800
DPCRPGVK,sno,C,684,false,"hot5-4 / wildtype, FAT-switch S-nitrosoproteome",169,37277371,,,,,,,,
DSVVLCQNAGVK,sno,C,695,true,"hot5-4 / wildtype, FAT-switch S-nitrosoproteome",169,37277371,,,,-0.5323022,0.0611632,NO,,
AIALECGILSSDADLSEPTLIEGK,ph,S,724,true,"Phosphorylation in N starvation",63,22060019,"MASCOT Score",37.0000000,,,,,,-7.8336100
LLLVQSLRR,ph,S,772,true,"Tissue atlas Arabidopsis - ProteomicsDB",114,32188942,"MaxQuant score",81.6760000,1.0000000,,,,0.00079242297215387,
KEPLITNIMWR,ub,K,908,true,"upl3 mutant / wildtype",168,35926874,"MaxQuant score",59.1980000,1.0000000,-0.2327690,0.6681400,NO,0.0019953800365329,0.1980900
KNSSGEGSL,ph,S,1073,true,"Plasmembrane Ph Immune Responses",25,17651370,,,,,,,,
KNSSGEGSL,ph,S,1073,true,"atm and atr DNA damage response",88,25561503,"MASCOT Score",34.0000000,1.0000000,,,,,-0.5300000
