Peptide,PTM,ModifiedAA,ModifiedPosition,PeptideUniqueToGene,ExperimentDesc,ExpID,PubmedID,ScoreType,IdentScore,LocProb,Log2FChange,PQ-val,QuantSig,PEP,MassErrorPPM
TTAVNTVSGDEDR,nta,T,2,true,"Characterization plant N-terminal acetylation",6,22223895,"MASCOT Score",73.6300000,,,,,,
AKEELDAVIGAIHQR,ub,K,38,true,"Arabidopsis ubiquitination COFRADIC",40,26744219,"MaxQuant Score",54.8980000,1.0000000,,,,5.1349998102523E-6,-0.6570000
DKMEFKSDKPEDGK,ub,K,61,true,"Arabidopsis ubiquitination by TUBEs",2,23667124,,,,,,,,
DKMEFKSDKPEDGK,ub,K,61,true,"MudPIT plant ubiquitination",103,17272265,XCorr,2.5300000,,,,,,
DKMEFKSDKPEDGK,ub,K,64,true,"MudPIT plant ubiquitination",103,17272265,XCorr,2.3400000,,,,,,
EDLKSLFLK,ph,S,84,true,"Tissue atlas Arabidopsis - ProteomicsDB",114,32188942,"MaxQuant score",111.9400000,1.0000000,,,,0.00088852801127359,
SDDISENTPVDEVK,ph,S,106,true,"Tissue atlas Arabidopsis - ProteomicsDB",114,32188942,"MaxQuant score",214.4700000,1.0000000,,,,0,
SRSLSPEKER,ph,S,156,true,"Phospho cell culture sucrose/TOR",109,30833711,,,0.9999370,,,,,
SLSPEKER,ph,S,156,true,"Ethylene-regulated phosphorylation ein2 mutant",30,19253305,"MASCOT Score",42.2222000,,,,,,-17.1318950
SLSPEKER,ph,S,156,true,"Tissue atlas Arabidopsis - ProteomicsDB",114,32188942,"MaxQuant score",99.5060000,1.0000000,,,,0.0019632899202406,
SLSPEKER,ph,S,158,true,"Ethylene-regulated phosphorylation ein2 mutant",30,19253305,"MASCOT Score",42.2222000,,,,,,-17.1318950
SLSPEKER,ph,S,158,true,"STN8 phosphoproteome",38,21768351,"MASCOT Score",46.5100000,,,,,,1.0644400
SLSPEKER,ph,S,158,true,"Chloroplast kinase substrates",60,19376835,"MASCOT Score",36.0100000,,,,,,1.4736100
SLSPEKER,ph,S,158,true,"Protein sumoylation and phosphorylation cross-talk",97,28419593,,,,,,,,
SLSPEKER,ph,S,158,true,"Tissue atlas Arabidopsis - ProteomicsDB",114,32188942,"MaxQuant score",114.4000000,1.0000000,,,,0.0019632899202406,
SLSPEKER,ub,K,161,true,"Protein ubiquitination during photomorphogenesis",3,28461270,,,,,,,,
ICSPWSDDKKD,acy,C,178,true,"Arabidopsis S-acylation atlas - Silique",163e,35681017,,,,,,,,
ICSPWSDDK,acy,C,178,true,"Arabidopsis S-acylation atlas - Meristem",163a,35681017,,,,,,,,
ICSPWSDDK,acy,C,178,true,"Arabidopsis S-acylation atlas - Hypocotyl",163b,35681017,,,,,,,,
ICSPWSDDK,acy,C,178,true,"Arabidopsis S-acylation atlas - Silique",163e,35681017,,,,,,,,
