Peptide,PTM,ModifiedAA,ModifiedPosition,PeptideUniqueToGene,ExperimentDesc,ExpID,PubmedID,ScoreType,IdentScore,LocProb,Log2FChange,PQ-val,QuantSig,PEP,MassErrorPPM
SKSIASDLSSLSSMQSR,ph,S,137,true,"atm and atr DNA damage response",88,25561503,"MASCOT Score",45.0000000,0.9950000,,,,,-0.2400000
SIASDLSSLSSMQSR,ph,S,137,true,"srk2dei ABA signaling phopshoproteomics",83,23572148,"MASCOT Score",62.0000000,,,,,,0.0021000
SIASDLSSLSSMQSR,ph,S,137,true,"atm and atr DNA damage response",88,25561503,"MASCOT Score",73.0000000,1.0000000,,,,,-0.3500000
SIASDLSSLSSMQSR,ph,S,137,true,"TOR Kinase and ABA Receptor",100,29290610,XCorr,5.2504845,0.9995000,,,,5.402000056165E-7,
SIASDLSSLSSMQSR,ph,S,137,true,"Tissue atlas Arabidopsis - ProteomicsDB",114,32188942,"MaxQuant score",260.3300000,0.9998150,,,,0,
SMSDSNLNNVR,ph,S,296,true,"Tissue atlas Arabidopsis - ProteomicsDB",114,32188942,"MaxQuant score",87.0260000,0.9999910,,,,0.0012217400362715,
RSMSDSNLNNVR,ph,S,298,true,"atm and atr DNA damage response",88,25561503,"MASCOT Score",46.0000000,0.9370000,,,,,-0.3500000
SMSDSNLNNVRK,ph,S,298,true,"TOR Kinase and ABA Receptor",100,29290610,XCorr,3.4969878,0.9999000,,,,6.9900001108181E-5,
SMSDSNLNNVR,ph,S,298,true,"Tyrosine phosphorylation in Arabidopsis",59,18463617,"MASCOT Score",43.0000000,,,,,,-0.4560927
SMSDSNLNNVR,ph,S,298,true,"srk2dei ABA signaling phopshoproteomics",83,23572148,"MASCOT Score",64.0000000,,,,,,-0.0002000
SMSDSNLNNVR,ph,S,298,true,"atm and atr DNA damage response",88,25561503,"MASCOT Score",53.0000000,0.9930000,,,,,-0.1400000
SMSDSNLNNVR,ph,S,298,true,"Protein sumoylation and phosphorylation cross-talk",97,28419593,,,,,,,,
SMSDSNLNNVR,ph,S,298,true,"TOR Kinase and ABA Receptor",100,29290610,XCorr,4.0477147,0.9993000,,,,1.9810000594589E-5,
SMSDSNLNNVR,ph,S,298,true,"Tissue atlas Arabidopsis - ProteomicsDB",114,32188942,"MaxQuant score",338.3400000,1.0000000,,,,0,
SMSDSNLNNVR,ph,S,300,true,"srk2dei ABA signaling phopshoproteomics",83,23572148,"MASCOT Score",53.0000000,,,,,,-0.0007000
SMSDSNLNNVR,ph,S,300,true,"atm and atr DNA damage response",88,25561503,"MASCOT Score",26.0000000,0.8890000,,,,,0.0100000
MISNFEVKVTQDTK,ph,T,317,true,"srk2dei ABA signaling phopshoproteomics",83,23572148,"MASCOT Score",28.0000000,,,,,,0.0007000
MISNFEVKVTQDTK,ph,T,320,true,"srk2dei ABA signaling phopshoproteomics",83,23572148,"MASCOT Score",28.0000000,,,,,,0.0007000
SLVVEVR,ph,S,413,true,"STN8 phosphoproteome",38,21768351,"MASCOT Score",51.1700000,,,,,,0.0981551
