Peptide,PTM,ModifiedAA,ModifiedPosition,PeptideUniqueToGene,ExperimentDesc,ExpID,PubmedID,ScoreType,IdentScore,LocProb,Log2FChange,PQ-val,QuantSig,PEP,MassErrorPPM
ADEIVPPATQLAAVSLENDGSTVQR,nt,A,2,true,"Arg/N-end rule seed, prt6 vs. Wt",99,29168982,"MASCOT Score",32.0900000,,,,,0.018419999629259,-1.3327512
ADEIVPPATQLAAVSLENDGSTVQR,nt,A,2,true,"FtsH12 N-terminome: WT / FtsH12 knockdown miRNA",118,33216923,"MaxQuant score",100.6700000,,,,,3.9800000101176E-11,
ADEIVPPATQLAAVSLENDGSTVQRAQF,nta,A,2,true,"Arabidopsis translation initiation landscape - NTA",167a,35069635,,,,,,,,
ADEIVPPATQLAAVSLENDGSTVQR,nta,A,2,true,"Characterization plant N-terminal acetylation",6,22223895,"MASCOT Score",53.5400000,,,,,,
ADEIVPPATQLAAVSLENDGSTVQR,nta,A,2,true,"Arg/N-end rule pathway Roots",80,25728785,"MASCOT Score",36.2300000,,,,,0.0004909000126645,
ADEIVPPATQLAAVSLENDGSTVQR,nta,A,2,true,"Arg/N-end rule seed, prt6 vs. Wt",99,29168982,"MASCOT Score",32.0900000,,,,,0.018419999629259,-1.3327512
ADEIVPPATQLAAVSLENDGSTVQR,nta,A,2,true,"HUNTER N-terminome: legumain, GluC and trypsin",119,31951383,"MaxQuant score",110.2600000,,,,,,
ADEIVPPATQLAAVSLEN,nta,A,2,true,"HUNTER N-terminome: legumain, GluC and trypsin",119,31951383,"MaxQuant score",109.8300000,,,,,,
AVSLENDGSTVQR,nt,A,14,true,"Tic56 chloroplast import - tic56-1",89c,25588737,XCorr,2.8583915,,,,,,
LVATGTCVTVDGVLK,so,C,104,false,"Arabidopsis S-sulfenylation chemoproteomics",108,31578252,"pFind PSM Score",0.0002118,,1.0869600,,,,-0.5459507
LVATGTCVTVDGVLK,so,C,104,false,"S-sulfenylation site detection using YAP1C",110,32714340,,,,,,,,
TLINYTE,nt,T,214,true,"Arg/N-end rule seed, prt6 vs. Wt",99,29168982,"MASCOT Score",41.3600000,,-0.5276695,0.1155022,NO,0.066100001335144,-0.7302333
NFDSGCIDRLK,so,C,399,true,"S-sulfenylation site detection using YAP1C",110,32714340,,,,,,,,
HCGFGLGFER,so,C,538,false,"Arabidopsis S-sulfenylation chemoproteomics",108,31578252,"pFind PSM Score",0.0536338,,0.9310500,,,,-1.2903695
HCGFGLGFER,so,C,538,false,"S-sulfenylation site detection using YAP1C",110,32714340,,,,,,,,
