Peptide,PTM,ModifiedAA,ModifiedPosition,PeptideUniqueToGene,ExperimentDesc,ExpID,PubmedID,ScoreType,IdentScore,LocProb,Log2FChange,PQ-val,QuantSig,PEP,MassErrorPPM
GKVHGSLARAGKVRGQTPKVAKQD,nt,G,2,false,"Arabidopsis translation initiation landscape - NT",167b,35069635,,,,,,,,
GKVHGSLARA,nt,G,2,false,"N-term acetylation drought responses",5,26184543,,,,,,,,
GKVHGSLAR,nt,G,2,false,"Arg/N-end rule pathway Roots",80,25728785,"MASCOT Score",32.3800000,,,,,0.09689000248909,
GKVHGSLAR,ub,K,3,false,"Arabidopsis ubiquitination COFRADIC",40,26744219,"MaxQuant Score",101.3800000,1.0000000,,,,0.00058330001775175,0.3790000
SLARAGKVRGQTPKVAKQD,nt,S,7,false,"Arabidopsis translation initiation landscape - NT",167b,35069635,,,,,,,,
GQTPKVAKQDKKKKPR,ub,K,23,false,"Arabidopsis ubiquitination COFRADIC",40,26744219,"MaxQuant Score",58.7120000,0.8710000,,,,0.00012559999595396,-0.4400000
GQTPKVAKQDKKKKPR,ub,K,29,false,"Arabidopsis ubiquitination COFRADIC",40,26744219,"MaxQuant Score",107.9800000,0.8390000,,,,4.3879999202027E-16,-0.1920000
AVVGFGKKR,nt,A,47,false,"Metacaspase9 substrates - in vitro rMC9",51c,23964026,"MASCOT Score",62.0000000,,5.6665610,,NO,,-0.1690970
AVVGFGKKR,nt,A,47,false,"Arabidopsis translation initiation landscape - NT",167b,35069635,,,,,,,,
VVGFGKKR,nt,V,48,false,"Metacaspase9 substrates - 35S:MC9 / mc9",51b,23964026,"MASCOT Score",54.0000000,,1.0269116,,NO,,0.2728079
FVTAVVGFGKK,ub,K,53,false,"Ubiquitination Membrane Proteins",120,33585938,,,,,,,,
RGPNSSEK,ph,S,59,false,"atm and atr DNA damage response",88,25561503,"MASCOT Score",35.0000000,0.9960000,,,,,0.2800000
RGPNSSEK,ph,S,60,false,"atm and atr DNA damage response",88,25561503,"MASCOT Score",36.0000000,0.9520000,,,,,-1.4500000
