Peptide,PTM,ModifiedAA,ModifiedPosition,PeptideUniqueToGene,ExperimentDesc,ExpID,PubmedID,ScoreType,IdentScore,LocProb,Log2FChange,PQ-val,QuantSig,PEP,MassErrorPPM
AKQLHFNKDGTAIKKL,nt,A,52,true,"Arabidopsis translation initiation landscape - NT",167b,35069635,,,,,,,,
KLQAGVNK,ub,K,66,true,"Ubiquitination Membrane Proteins",120,33585938,,,,,,,,
AGVNKLADLVGVTLGPKGR,nt,A,69,false,"Stromal N-terminome",96,26371235,"MASCOT Score",53.2700000,,,,,,
LADLVGVTLGPKGR,nt,L,74,false,"Stromal N-terminome",96,26371235,"MASCOT Score",41.2500000,,,,,,
LADLVGVTLGPKGR,ac,K,85,false,"Quantitative Acetylproteomics",101,29440448,,,,,,,,
NVVLESKYGSPR,ac,K,94,false,"Histone deacetylases - apicidin vs control",98a,29061669,"MaxQuant Score",88.1000000,1.0000000,0.1790000,0.5445027,NO,2.6999998681276E-7,
NVVLESKYGSPR,ac,K,94,false,"Histone deacetylases substrates - TSA vs control",98b,29061669,"MaxQuant Score",88.1000000,1.0000000,-0.0020000,0.9977001,NO,2.6999998681276E-7,
NVVLESKYGSPR,ac,K,94,false,"Histone deacetylases substrates - hda14 vs WT",98e,29061669,"MaxQuant Score",88.1000000,1.0000000,0.6330000,0.2517677,NO,6.4999999267457E-6,
EVELEDPVENIGAKLVR,nt,E,110,false,"Metacaspase9 substrates - Col-0 / mc9",51a,23964026,"MASCOT Score",55.0000000,,3.1841684,,NO,,-1.2152861
EVELEDPVENIGAKLVR,nt,E,110,false,"Metacaspase9 substrates - 35S:MC9 / mc9",51b,23964026,"MASCOT Score",58.0000000,,3.6692754,,NO,,-1.2152861
EVELEDPVENIGAKLVR,nt,E,110,false,"Stromal N-terminome",96,26371235,"MASCOT Score",49.3500000,,,,,,
EVELEDPVENIGAKLVR,nt,E,110,false,"Arabidopsis translation initiation landscape - NT",167b,35069635,,,,,,,,
EVELEDPVENIGAKLVR,ub,K,123,false,"Arabidopsis ubiquitination COFRADIC",40,26744219,"MaxQuant Score",123.0200000,1.0000000,,,,1.5430000018837E-29,0.1500000
VVEGMQFDR,nt,V,239,false,"Arg/N-end rule seed, prt6 vs. Wt",99,29168982,"MASCOT Score",20.8600000,,-0.1535073,0.8056290,NO,0.20299999415874,-0.5536685
GYISPYFVTDSEK,ph,S,258,false,"srk2dei ABA signaling phopshoproteomics",83,23572148,"MASCOT Score",41.0000000,,,,,,0.0015000
GYISPYFVTDSEK,ph,S,258,false,"TOR Kinase and ABA Receptor",100,29290610,XCorr,3.2722793,0.9192000,,,,0.00081729999510571,
GYISPYFVTDSEK,ph,S,258,false,"Phospho cell culture sucrose/TOR",109,30833711,,,0.8259050,,,,,
VIQVGAQTE,nt,V,428,false,"Arg/N-end rule seed, prt6 vs. Wt",99,29168982,"MASCOT Score",36.7900000,,0.1992736,0.5705263,NO,0.020530000329018,1.6103023
AAVEEGIVVGGGCTLLR,acy,C,467,false,"Arabidopsis S-acylation atlas - Meristem",163a,35681017,,,,,,,,
AAVEEGIVVGGGCTLLR,sno,C,467,false,"Site-specific nitrosomeproteomic id - gsnor1-3",90b,25699590,XCorr,3.2652442,,,,,0.11959999799728,-7.2060530
AAVEEGIVVGGGCTLLR,sno,C,467,false,"hot5-4 / wildtype, FAT-switch S-nitrosoproteome",169,37277371,,,,,,,,
AAVEEGIVVGGGCTLLR,so,C,467,false,"Arabidopsis S-sulfenylation chemoproteomics",108,31578252,"pFind PSM Score",0.0001313,,1.7948700,,,,-1.4442243
AAVEEGIVVGGGCTLLR,so,C,467,false,"S-sulfenylation site detection using YAP1C",110,32714340,,,,,,,,
LASKVDAIK,ph,S,474,false,"Phosphoproteome ethylene-regulated time response",46,24043427,"MASCOT Score",42.7300000,,,,,,33.7707000
LASKVDAIK,ph,S,474,false,"Tyrosine phosphorylation in Arabidopsis",59,18463617,"MASCOT Score",24.0000000,,,,,,-0.6839037
LASKVDAIK,ph,S,474,false,"srk2dei ABA signaling phopshoproteomics",83,23572148,"MASCOT Score",40.0000000,,,,,,-0.0004000
LASKVDAIK,ph,S,474,false,"LAXIC - mannitol vs control",84b,23660473,XCorr,2.0600000,1.0000000,,,,0.0016027300152928,
LASKVDAIK,ph,S,474,false,"SnRK2 protein kinase substrates",85,23776212,XCorr,2.6837683,1.0000000,,,,3.7346200087995E-7,
LASKVDAIK,ph,S,474,false,"atm and atr DNA damage response",88,25561503,"MASCOT Score",43.0000000,1.0000000,,,,,-3.4800000
LASKVDAIK,ph,S,474,false,"Tissue atlas Arabidopsis - ProteomicsDB",114,32188942,"MaxQuant score",126.1200000,1.0000000,,,,2.0740799355767E-10,
LASKVDAIK,ac,K,475,false,"Quantitative Acetylproteomics",101,29440448,,,,,,,,
ALSYPLKLIAK,ac,K,504,false,"Histone deacetylases - apicidin vs control",98a,29061669,"MaxQuant Score",92.6000000,1.0000000,0.4590000,0.1770109,NO,0.012000000104308,
ALSYPLKLIAK,ac,K,504,false,"Quantitative Acetylproteomics",101,29440448,,,,,,,,
LIAKNAGVNGSVVSEK,ac,K,508,false,"Quantitative Acetylproteomics",101,29440448,,,,,,,,
NAGVNGSVVSEK,ng,N,513,false,"Conserved N-glycosylation",74,22633491,"MaxQuant Score",76.8240000,1.0000000,,,,0.0010000000474975,-3.5130000
NAGVNGSVVSEK,ph,S,515,false,"Lateral root-induction - NAA vs control",106,23328941,"MASCOT Score",28.0000000,,,,,,
NAGVNGSVVSEK,ph,S,515,false,"Tissue atlas Arabidopsis - ProteomicsDB",114,32188942,"MaxQuant score",153.2200000,0.9999620,,,,1.3569899692811E-7,
YEDLMAAGIIDPTK,mox,M,542,false,"cat2 Methionine oxidation - 3h stress",62b,25693801,"MASCOT Score",36.0000000,,0.1521109,,NO,,
CCLEHASSVAK,sno,C,555,true,"hot5-4 / wildtype, FAT-switch S-nitrosoproteome",169,37277371,,,,,,,,
CCLEHASSVAK,so,C,555,true,"Arabidopsis S-sulfenylation chemoproteomics",108,31578252,"pFind PSM Score",0.1232370,,1.0313700,,,,0.6495990
CCLEHASSVAK,so,C,556,true,"Arabidopsis S-sulfenylation chemoproteomics",108,31578252,"pFind PSM Score",0.1232370,,,,,,0.6495990
CCLEHASSVAK,ph,S,561,true,"Tissue atlas Arabidopsis - ProteomicsDB",114,32188942,"MaxQuant score",167.1100000,0.7674210,,,,1.9724100824847E-11,
CCLEHASSVAK,ph,S,562,true,"Tissue atlas Arabidopsis - ProteomicsDB",114,32188942,"MaxQuant score",104.3000000,0.9479660,,,,5.5148000683403E-5,
