Peptide,PTM,ModifiedAA,ModifiedPosition,PeptideUniqueToGene,ExperimentDesc,ExpID,PubmedID,ScoreType,IdentScore,LocProb,Log2FChange,PQ-val,QuantSig,PEP,MassErrorPPM
ADAETFAFQAEINQLL,nta,A,2,false,"Characterization plant N-terminal acetylation",6,22223895,"MASCOT Score",48.2900000,,,,,,
ADAETFAFQAEINQLL,nta,A,2,false,"Arabidopsis translation initiation landscape - NTA",167a,35069635,,,,,,,,
LIINTFYSNKE,nt,L,19,false,"Arabidopsis translation initiation landscape - NT",167b,35069635,,,,,,,,
TFYSNKE,nt,T,23,false,"Arg/N-end rule seed, prt6 vs. Wt",99,29168982,"MASCOT Score",23.1400000,,,,,0.0030340000521392,0.1723742
ELISNSSDALDK,ph,S,40,false,"Tissue atlas Arabidopsis - ProteomicsDB",114,32188942,"MaxQuant score",102.7300000,0.7791400,,,,0.0001112780009862,
IRFESLTDKSK,ac,K,54,false,"Quantitative Acetylproteomics",101,29440448,,,,,,,,
FESLTDKSK,ac,K,54,false,"Quantitative Acetylproteomics",101,29440448,,,,,,,,
IRFESLTDKSK,ub,K,54,false,"upl3 mutant / wildtype",168,35926874,"MaxQuant score",86.8980000,1.0000000,0.2521734,0.7013400,NO,0.0079127503558993,-1.1432000
TLTIIDSGIGMTKADLVNNLGTIARSGTKE,nt,T,75,false,"Arabidopsis translation initiation landscape - NT",167b,35069635,,,,,,,,
TLTIIDSGIGMTKADLVNNLGTIAR,nt,T,75,false,"Arg/N-end rule pathway Roots",80,25728785,"MASCOT Score",28.4000000,,,,,0.0024149999953806,
SGIGMTKADLVNNLGTIARSGTKE,nt,S,81,false,"Arabidopsis translation initiation landscape - NT",167b,35069635,,,,,,,,
DTSGETLGR,nt,D,162,true,"Metacaspase9 substrates - in vitro rMC9",51c,23964026,"MASCOT Score",44.0000000,,,,,,0.3982172
TIEKEISDDEEEEEKKDEEGK,ph,S,219,false,"Arabidopsis root NAA phosphoproteome",18a,27643528,"MaxQuant Score",262.7900000,1.0000000,,,,0,0.1110000
EISDDEEEEEKKDEEGK,ph,S,219,false,"Tyrosine phosphorylation in Arabidopsis",59,18463617,"MASCOT Score",57.0000000,,,,,,-0.5196475
EISDDEEEEEKKDEEGK,ph,S,219,false,"srk2dei ABA signaling phopshoproteomics",83,23572148,"MASCOT Score",52.0000000,,,,,,0.0018000
EISDDEEEEEKKDEEGK,ph,S,219,false,"Brassinosteroid-Regulated Phosphorylation Dynamics",94,26187819,"MaxQuant Score",131.8200000,1.0000000,,,,1.0249999604639E-6,1.1030000
EISDDEEEEEKKDEEGK,ph,S,219,false,"TOR Kinase and ABA Receptor",100,29290610,XCorr,2.9739063,1.0000000,,,,0.00010450000263518,
TIEKEISDDEEEEEKK,ph,S,219,false,"PAMP-triggered phosphorylation",48,24601666,"MASCOT Score",27.0700000,,,,,,
TIEKEISDDEEEEEKK,ph,S,219,false,"LAXIC - ABA stress",84a,23660473,XCorr,2.3500000,0.9420000,,,,0.12070500105619,
TIEKEISDDEEEEEKK,ph,S,219,false,"LAXIC - mannitol vs control",84b,23660473,XCorr,2.0700000,0.8260000,,,,0.0031956899911165,
TIEKEISDDEEEEEKK,ph,S,219,false,"SnRK2 protein kinase substrates",85,23776212,XCorr,2.9856689,0.9960000,,,,0.0056761200539768,
TIEKEISDDEEEEEKK,ph,S,219,false,"Phospho cell culture sucrose/TOR",109,30833711,,,1.0000000,,,,,
TIEKEISDDEEEEEKK,ph,S,219,false,"Tissue atlas Arabidopsis - ProteomicsDB",114,32188942,"MaxQuant score",510.1400000,1.0000000,,,,0,
TIEKEISDDEEEEEK,ph,S,219,false,"Phosphorylation nuclei-enriched fractions",28,19245862,,,,,,,,
TIEKEISDDEEEEEK,ph,S,219,false,"Tyrosine phosphorylation in Arabidopsis",59,18463617,"MASCOT Score",77.0000000,,,,,,-0.6835754
TIEKEISDDEEEEEK,ph,S,219,false,"Conserved plant phosphoproteome - Arabidopsis",61a,20466843,"MASCOT Score",77.0000000,1.0000000,,,,,
TIEKEISDDEEEEEK,ph,S,219,false,"BSK8 and BSL2 regulating sucrose-ph synthase",66,24924143,"MaxQuant Score",139.1100000,,,,,,0.0061232
TIEKEISDDEEEEEK,ph,S,219,false,"LAXIC - ABA stress",84a,23660473,XCorr,5.2500000,1.0000000,,,,0.0009292010217905,
TIEKEISDDEEEEEK,ph,S,219,false,"LAXIC - mannitol vs control",84b,23660473,XCorr,5.4600000,1.0000000,,,,3.0899998819223E-5,
TIEKEISDDEEEEEK,ph,S,219,false,"SnRK2 protein kinase substrates",85,23776212,XCorr,5.1865702,1.0000000,,,,4.0637702092283E-9,
TIEKEISDDEEEEEK,ph,S,219,false,"atm and atr DNA damage response",88,25561503,"MASCOT Score",59.0000000,1.0000000,,,,,1.5900000
TIEKEISDDEEEEEK,ph,S,219,false,"TOR Kinase and ABA Receptor",100,29290610,XCorr,4.8490362,1.0000000,,,,5.3500002650253E-7,
TIEKEISDDEEEEEK,ph,S,219,false,"Col-0 callus - FC Col-0 vs. Col-0 Xray",111a,31410901,,82.2400000,,1.0808901,0.0276473,YES,,1.3976002
TIEKEISDDEEEEEK,ph,S,219,false,"Col-0 X-ray callus - FC Col-0 vs. Col-0 Xray",111b,31410901,,82.2400000,,1.0808901,0.0276473,YES,,1.3976002
TIEKEISDDEEEEEK,ph,S,219,false,"atm callus - FC atm vs. atm Xray",111c,31410901,,82.2400000,,0.5767717,0.1865595,NO,,1.3976002
TIEKEISDDEEEEEK,ph,S,219,false,"atm-3 X-ray callus - FC atm vs. atm Xray",111d,31410901,,82.2400000,,0.5767717,0.1865595,NO,,1.3976002
EISDDEEEEEKK,ph,S,219,false,"Tyrosine phosphorylation in Arabidopsis",59,18463617,"MASCOT Score",24.0000000,,,,,,-0.3849629
EISDDEEEEEKK,ph,S,219,false,"srk2dei ABA signaling phopshoproteomics",83,23572148,"MASCOT Score",56.0000000,,,,,,0.0007000
EISDDEEEEEKK,ph,S,219,false,"atm and atr DNA damage response",88,25561503,"MASCOT Score",52.0000000,1.0000000,,,,,-0.3000000
EISDDEEEEEKK,ph,S,219,false,"TOR Kinase and ABA Receptor",100,29290610,XCorr,2.3248513,1.0000000,,,,0.0167699996382,
EISDDEEEEEK,ph,S,219,false,"Ethylene-regulated phosphorylation ein2 mutant",30,19253305,"MASCOT Score",53.9683000,,,,,,-0.9386759
EISDDEEEEEK,ph,S,219,false,"Mitochondrial phosphoproteome",32,19688752,"MASCOT Score",46.0800000,,,,,,-13.9981000
EISDDEEEEEK,ph,S,219,false,"Pollen phosphoproteome Arabidopsis",43,22631563,"MASCOT Score",59.9100000,,,,,,-3.0801700
EISDDEEEEEK,ph,S,219,false,"Tyrosine phosphorylation in Arabidopsis",59,18463617,"MASCOT Score",48.0000000,,,,,,-0.9087757
EISDDEEEEEK,ph,S,219,false,"srk2dei ABA signaling phopshoproteomics",83,23572148,"MASCOT Score",53.0000000,,,,,,0.0008000
EISDDEEEEEK,ph,S,219,false,"LAXIC - ABA stress",84a,23660473,XCorr,2.9800000,1.0000000,,,,0.022136699408293,
EISDDEEEEEK,ph,S,219,false,"LAXIC - mannitol vs control",84b,23660473,XCorr,3.7200000,1.0000000,,,,0.0051738601177931,
EISDDEEEEEK,ph,S,219,false,"SnRK2 protein kinase substrates",85,23776212,XCorr,3.4969263,1.0000000,,,,0.010242899879813,
EISDDEEEEEK,ph,S,219,false,"SIRK1 phosphorylation",86a,23820729,"MaxQuant Score",110.0400000,1.0000000,,,,0.054000001400709,5.3880000
EISDDEEEEEK,ph,S,219,false,"SIRK1 exp - sirk1 mutant vs WT",86b,23820729,,,,1.0743827,,NO,,
EISDDEEEEEK,ph,S,219,false,"SIRK1 exp - 35S:SIRK1 vs WT",86c,23820729,,,,0.7637085,,NO,,
EISDDEEEEEK,ph,S,219,false,"atm and atr DNA damage response",88,25561503,"MASCOT Score",67.0000000,1.0000000,,,,,-0.3300000
EISDDEEEEEK,ph,S,219,false,"TOR Kinase and ABA Receptor",100,29290610,XCorr,3.4166131,1.0000000,,,,7.999999797903E-5,
EISDDEEEEEK,ph,S,219,false,"Lateral root-induction - NAA vs control",106,23328941,"MASCOT Score",46.0000000,,,,,,
EISDDEEEEEK,ph,S,219,false,"Col-0 callus - FC Col-0 vs. Col-0 Xray",111a,31410901,,37.8200000,,-2.0474334,0.0000000,NO,,-0.0110263
EISDDEEEEEK,ph,S,219,false,"Col-0 X-ray callus - FC Col-0 vs. Col-0 Xray",111b,31410901,,37.8200000,,-2.0474334,0.0000000,NO,,-0.0110263
EISDDEEEEEK,ph,S,219,false,"atm callus - FC atm vs. atm Xray",111c,31410901,,37.8200000,,-4.1470891,0.0000000,NO,,-0.0110263
EISDDEEEEEK,ph,S,219,false,"atm-3 X-ray callus - FC atm vs. atm Xray",111d,31410901,,37.8200000,,-4.1470891,0.0000000,NO,,-0.0110263
IKEVSHEWDLVNK,ub,K,252,false,"Ubiquitination Membrane Proteins",120,33585938,,,,,,,,
IKEVSHEWDLVNK,ub,K,252,false,"upl3 mutant / wildtype",168,35926874,"MaxQuant score",160.7800000,1.0000000,-0.6281624,0.5237400,NO,7.5432900282558E-15,0.5746900
IKEVSHEWDLVNK,ph,S,255,false,"Tissue atlas Arabidopsis - ProteomicsDB",114,32188942,"MaxQuant score",231.1700000,1.0000000,,,,3.9012149246803E-42,
EVSHEWDLVNKQKPIWMR,ub,K,263,false,"upl3 mutant / wildtype",168,35926874,"MaxQuant score",136.8100000,0.9890000,-0.8783214,,,2.5638899572747E-15,0.8193100
KPEEINKEEYAAFYK,cr,K,271,false,"Open search Plant PTM Viewer 2.0 - Crotonylation",164c,TBA,,,,,,,,
KPEEINKEEYAAFYK,ub,K,277,false,"upl3 mutant / wildtype",168,35926874,"MaxQuant score",99.9270000,0.9960000,-0.4900509,,,4.6848501256136E-7,-1.3549000
SLSNDWEEHLAVK,ph,S,288,false,"Arabidopsis root NAA phosphoproteome",18a,27643528,"MaxQuant Score",75.9110000,0.9670000,,,,1.7889999526233E-7,-0.0670000
SLSNDWEEHLAVK,ph,S,288,false,"TOR Kinase and ABA Receptor",100,29290610,XCorr,3.2641122,0.9155000,,,,0.00020840000070166,
SLSNDWEEHLAVK,ph,S,288,false,"Lateral root-induction - NAA vs control",106,23328941,"MASCOT Score",31.0000000,,0.2368838,0.3710634,NO,,
SLSNDWEEHLAVK,ph,S,288,false,"Phospho cell culture sucrose/TOR",109,30833711,,,0.9838000,,,,,
SLSNDWEEHLAVK,ph,S,288,false,"Tissue atlas Arabidopsis - ProteomicsDB",114,32188942,"MaxQuant score",211.0600000,0.9999980,,,,2.2513793621259E-39,
HLAVKHFSVE,nt,H,294,false,"Arabidopsis translation initiation landscape - NT",167b,35069635,,,,,,,,
AILFVPKRAPF,nt,A,310,false,"Arabidopsis translation initiation landscape - NT",167b,35069635,,,,,,,,
AILFVPKR,ac,K,316,false,"Quantitative Acetylproteomics",101,29440448,,,,,,,,
RAPFDLFDTKK,ac,K,326,false,"Quantitative Acetylproteomics",101,29440448,,,,,,,,
VFIMDNCEDIIPEYLGFVK,ox,C,345,false,"SPEAR - 10 mM H2O2 / mock",138a,34619326,,,,-1.0767830,0.0299794,YES,,
VFIMDNCEDIIPEYLGFVK,ox,C,345,false,"SPEAR - 50 mM H2O2 / mock",138b,34619326,,,,-0.7175523,0.0202067,YES,,
VFIMDNCEDIIPEYLGFVK,so,C,345,false,"S-sulfenylation site detection using YAP1C",110,32714340,,,,,,,,
DIIPEYLGFVKGIVDSE,nt,D,347,false,"Arabidopsis translation initiation landscape - NT",167b,35069635,,,,,,,,
FVKGIVDSEDLPLNISR,nt,F,355,false,"Arabidopsis translation initiation landscape - NT",167b,35069635,,,,,,,,
GIVDSEDLPLNISR,ph,S,370,false,"Tissue atlas Arabidopsis - ProteomicsDB",114,32188942,"MaxQuant score",203.8700000,1.0000000,,,,5.0208523976758E-42,
ETLQQNKILK,ac,K,378,false,"Quantitative Acetylproteomics",101,29440448,,,,,,,,
ETLQQNKILK,ub,K,378,false,"upl3 mutant / wildtype",168,35926874,"MaxQuant score",96.1430000,1.0000000,-0.3147326,,,0.0017616599798203,0.4960300
CLELFFEIAENKEDYNK,so,C,391,false,"S-sulfenylation site detection using YAP1C",110,32714340,,,,,,,,
SKNLKLGIHEDSQNR,nt,S,413,false,"Arabidopsis translation initiation landscape - NT",167b,35069635,,,,,,,,
FYEAFSKNLK,ac,K,414,false,"Quantitative Acetylproteomics",101,29440448,,,,,,,,
GIHEDSQNR,nt,G,419,false,"Arg/N-end rule seed, prt6 vs. Wt",99,29168982,"MASCOT Score",35.9100000,,,,,0.096589997410774,-0.2021901
LGIHEDSQNR,ph,S,424,false,"Phospho cell culture sucrose/TOR",109,30833711,,,1.0000000,,,,,
LGIHEDSQNR,ph,S,424,false,"Tissue atlas Arabidopsis - ProteomicsDB",114,32188942,"MaxQuant score",109.1500000,1.0000000,,,,0.00022444799833465,
TKIAELLR,nt,T,428,false,"Arabidopsis translation initiation landscape - NT",167b,35069635,,,,,,,,
TKIAELLR,ac,K,429,false,"Quantitative Acetylproteomics",101,29440448,,,,,,,,
TKIAELLR,ub,K,429,false,"Arabidopsis ubiquitination COFRADIC",40,26744219,"MaxQuant Score",78.1130000,1.0000000,,,,0.026000000536442,-0.0240000
ELLRYHSTKSG,nt,E,432,false,"Arabidopsis translation initiation landscape - NT",167b,35069635,,,,,,,,
LLRYHSTKSGDE,nt,L,433,false,"Arabidopsis translation initiation landscape - NT",167b,35069635,,,,,,,,
YHSTKSGDELTSLKDYVTR,ac,K,440,false,"Quantitative Acetylproteomics",101,29440448,,,,,,,,
YHSTKSGDELTSLK,ac,K,440,false,"Quantitative Acetylproteomics",101,29440448,,,,,,,,
SGDELTSLKDYVTR,ph,S,447,false,"Tissue atlas Arabidopsis - ProteomicsDB",114,32188942,"MaxQuant score",145.6100000,0.9873360,,,,1.4620499655393E-7,
SGDELTSLKDYVTR,cr,K,449,false,"Open search Plant PTM Viewer 2.0 - Crotonylation",164c,TBA,,,,,,,,
DYVTRMK,mox,M,455,false,"cat2 Methionine oxidation - 3h stress",62b,25693801,"MASCOT Score",31.0000000,,-0.6964445,,NO,,
MKEGQNDIFYITGESK,ub,K,456,false,"upl3 mutant / wildtype",168,35926874,"MaxQuant score",58.9800000,1.0000000,-0.5713216,0.5225200,NO,0.0003627699916251,0.6512100
KAVENSPFLEK,ub,K,471,false,"upl3 mutant / wildtype",168,35926874,"MaxQuant score",74.2370000,1.0000000,0.3138263,0.5940000,NO,0.00021065300097689,1.1986000
KAVENSPFLEK,ph,S,476,false,"Tissue atlas Arabidopsis - ProteomicsDB",114,32188942,"MaxQuant score",104.3000000,1.0000000,,,,0.00031249198946171,
KAVENSPFLEKLK,ac,K,481,false,"Quantitative Acetylproteomics",101,29440448,,,,,,,,
AVENSPFLEKLK,ac,K,481,false,"Histone deacetylases - apicidin vs control",98a,29061669,"MaxQuant Score",89.3000000,1.0000000,0.3450000,0.1896706,NO,2.099999960592E-7,
AVENSPFLEKLK,ac,K,481,false,"Quantitative Acetylproteomics",101,29440448,,,,,,,,
YMVDAIDE,nt,Y,491,false,"Arg/N-end rule seed, prt6 vs. Wt",99,29168982,"MASCOT Score",32.6900000,,,,,0.032699998468161,-0.1866760
GIEVLYMVDAIDEYAIGQLKEFEGK,ub,K,505,false,"Arabidopsis ubiquitination by TUBEs",2,23667124,,,,,,,,
EGLKLDETEDEKK,ac,K,529,false,"Quantitative Acetylproteomics",101,29440448,,,,,,,,
LDETEDEKKK,ac,K,529,false,"Quantitative Acetylproteomics",101,29440448,,,,,,,,
FEGLCK,ox,C,543,false,"OxiTRAQ Arabidopsis - 5 mM H2O2 versus control",47,24376095,,,,-0.0869923,0.0725369,NO,,
EKFEGLCK,sno,C,543,false,"hot5-4 / wildtype, FAT-switch S-nitrosoproteome",169,37277371,,,,,,,,
FEGLCK,sno,C,543,false,"hot5-4 / wildtype, FAT-switch S-nitrosoproteome",169,37277371,,,,1.1031089,0.0012645,YES,,
FEGLCK,so,C,543,false,"Arabidopsis S-sulfenylation chemoproteomics",108,31578252,"pFind PSM Score",0.1453990,,0.9664000,,,,0.2793421
FEGLCK,so,C,543,false,"S-sulfenylation site detection using YAP1C",110,32714340,,,,,,,,
FEGLCKVIK,ub,K,544,false,"upl3 mutant / wildtype",168,35926874,"MaxQuant score",85.6760000,1.0000000,-1.2276920,,,0.0041184201836586,-0.0859720
DVLGDKVEK,ac,K,553,false,"Quantitative Acetylproteomics",101,29440448,,,,,,,,
DVLGDKVEK,ub,K,553,false,"upl3 mutant / wildtype",168,35926874,"MaxQuant score",79.1480000,1.0000000,-0.2705560,0.5895200,NO,0.011858699843287,-2.2673000
DVLGDKVEKVIVSDR,hib,K,556,false,"Open search Plant PTM Viewer 2.0 - hib",164e,TBA,,,,,,,,
VIVSDRVVDSPCCLVTGEYGWTANMER,cn,C,568,false,"Cellular regulation by S-cyanylation",115,30377236,,,,,,,,
VVDSPCCLVTGEYGWTANMER,sno,C,568,false,"hot5-4 / wildtype, FAT-switch S-nitrosoproteome",169,37277371,,,,0.1336925,0.2628359,NO,,
VVDSPCCLVTGEYGWTANMER,so,C,568,false,"S-sulfenylation site detection using YAP1C",110,32714340,,,,,,,,
VIVSDRVVDSPCCLVTGEYGWTANMER,cn,C,569,false,"Cellular regulation by S-cyanylation",115,30377236,,,,,,,,
VVDSPCCLVTGEYGWTANMER,so,C,569,false,"S-sulfenylation site detection using YAP1C",110,32714340,,,,,,,,
IMKAQALR,me1,K,586,false,"Arabidopsis protein methylome",123,31809900,"MaxQuant Score",211.8700000,1.0000000,,,,0,-0.3127500
DSSMAGYMSSKKTMEINPENSIMDELR,nt,D,592,true,"Arabidopsis translation initiation landscape - NT",167b,35069635,,,,,,,,
SSMAGYMSSKKTMEINPENSIMDELR,nt,S,593,true,"Arabidopsis translation initiation landscape - NT",167b,35069635,,,,,,,,
AQALRDSSMAGYMSSK,ph,S,593,true,"Tissue atlas Arabidopsis - ProteomicsDB",114,32188942,"MaxQuant score",136.6800000,0.9479570,,,,2.8072099311771E-8,
DSSMAGYMSSK,ph,S,594,true,"Tissue atlas Arabidopsis - ProteomicsDB",114,32188942,"MaxQuant score",73.0820000,0.9979990,,,,0.0022197801154107,
DSSMAGYMSSKK,ac,K,602,true,"Quantitative Acetylproteomics",101,29440448,,,,,,,,
KTMEINPENSIMDELR,nt,K,603,false,"Arabidopsis translation initiation landscape - NT",167b,35069635,,,,,,,,
TMEINPENSIMDELR,nt,T,604,false,"Metacaspase9 substrates - Col-0 / mc9",51a,23964026,"MASCOT Score",80.0000000,,2.3541014,,NO,,-2.6359241
TMEINPENSIMDELR,nt,T,604,false,"Metacaspase9 substrates - 35S:MC9 / mc9",51b,23964026,"MASCOT Score",69.0000000,,2.8150204,,NO,,-2.1614588
FETALLTSGFSLDEPNTFGSR,nt,F,638,false,"Arabidopsis translation initiation landscape - NT",167b,35069635,,,,,,,,
ETALLTSGFSLDEPNTFGSR,nt,E,639,false,"Arabidopsis translation initiation landscape - NT",167b,35069635,,,,,,,,
TALLTSGFSLDEPNTFGSR,nt,T,640,false,"Arabidopsis translation initiation landscape - NT",167b,35069635,,,,,,,,
SGFSLDEPNTFGSR,nt,S,645,false,"Arabidopsis translation initiation landscape - NT",167b,35069635,,,,,,,,
LGLSIDDDDAVE,nt,L,665,true,"Arg/N-end rule seed, prt6 vs. Wt",99,29168982,"MASCOT Score",44.2800000,,-0.4394303,0.0062480,NO,1.7820000721258E-5,-2.1733910
GLSIDDDDAVE,nt,G,666,true,"Arg/N-end rule seed, prt6 vs. Wt",99,29168982,"MASCOT Score",60.8900000,,-2.6349910,0.0083125,YES,1.4590000319004E-5,-1.4035654
LSIDDDDAVE,nt,L,667,true,"Arg/N-end rule seed, prt6 vs. Wt",99,29168982,"MASCOT Score",67.9100000,,-1.9487769,0.0024905,YES,0.00010450000263518,-1.4750526
IDDDDAVE,nt,I,669,true,"Arg/N-end rule seed, prt6 vs. Wt",99,29168982,"MASCOT Score",46.6800000,,-2.2632877,0.0098704,YES,0.013369999825954,-0.8570224
