Peptide,PTM,ModifiedAA,ModifiedPosition,PeptideUniqueToGene,ExperimentDesc,ExpID,PubmedID,ScoreType,IdentScore,LocProb,Log2FChange,PQ-val,QuantSig,PEP,MassErrorPPM
DGSALAATLFQATGAAPGTSGFVNITDLR,ng,N,128,true,"Conserved N-glycosylation",74,22633491,"MaxQuant Score",246.3100000,1.0000000,,,,0,-0.2560000
DGSALAATLFQATGAAPGTSGFVNITDLR,ng,N,128,true,"N-linked Glycan Micro-heterogeneity Arabidopsis",134,29237727,,,,,,,,
DGSALAATLFQATGAAPGTSGFVNITDLR,ng,N,128,true,"UDP-GlcNAc transporter glycopeptide analysis",135,30224661,,,,,,,3.351733428021E-14,1.0000000
SIEEVPYNISIIQISR,ng,N,160,true,"Conserved N-glycosylation",74,22633491,"MaxQuant Score",196.2500000,1.0000000,,,,0,1.3550000
SIEEVPYNISIIQISR,ng,N,160,true,"N-glycan occupancy Arabidopsis glycoproteins",87,23994444,"Ladder score",57.0000000,,,,,,
SIEEVPYNISIIQISR,ng,N,160,true,"N-linked Glycan Micro-heterogeneity Arabidopsis",134,29237727,,,,,,,,
SIEEVPYNISIIQISR,ng,N,160,true,"UDP-GlcNAc transporter glycopeptide analysis",135,30224661,,,,,,,3.7542156171722E-15,0.6000000
GFLPKYK,ac,K,237,true,"Quantitative Acetylproteomics",101,29440448,,,,,,,,
YKNLTAPKK,ng,N,240,true,"Conserved N-glycosylation",74,22633491,"MaxQuant Score",108.5200000,1.0000000,,,,0.0070000002160668,0.4200000
YKNLTAPK,ng,N,240,true,"N-linked Glycan Micro-heterogeneity Arabidopsis",134,29237727,,,,,,,,
YKNLTAPK,ng,N,240,true,"UDP-GlcNAc transporter glycopeptide analysis",135,30224661,,,,,,,4.1803882595559E-6,1.0000000
IVDTLIDEQPLAIYATDK,ph,Y,317,true,"SIRK1 phosphorylation",86a,23820729,"MaxQuant Score",63.8050000,0.9400000,,,,1.8020000457764,5.9750000
IVDTLIDEQPLAIYATDK,ph,T,319,true,"SIRK1 phosphorylation",86a,23820729,"MaxQuant Score",63.8050000,0.9810000,,,,1.8020000457764,5.9750000
