Peptide,PTM,ModifiedAA,ModifiedPosition,PeptideUniqueToGene,ExperimentDesc,ExpID,PubmedID,ScoreType,IdentScore,LocProb,Log2FChange,PQ-val,QuantSig,PEP,MassErrorPPM
MDEGDGRDQMDQF,nta,M,1,true,"Arabidopsis translation initiation landscape - NTA",167a,35069635,,,,,,,,
EAEAESGGGGSGSGTDVVVASSGYGAQEVK,ph,S,106,true,"TOR Kinase and ABA Receptor",100,29290610,XCorr,4.5790057,0.8246000,,,,0.00037819999852218,
VSDVSQEIPGGIGTGTGGGLR,ph,S,135,true,"Large-scale phosphorylation discovery",44,23111157,XCorr,4.6230000,,,,,,
VSDVSQEIPGGIGTGTGGGLR,ph,S,135,true,"Tissue atlas Arabidopsis - ProteomicsDB",114,32188942,"MaxQuant score",111.3500000,0.9999460,,,,1.5294499607771E-12,
TQQAQSVIAQAK,ph,S,331,true,"Tissue atlas Arabidopsis - ProteomicsDB",114,32188942,"MaxQuant score",147.6600000,1.0000000,,,,9.3804300149714E-7,
TQQAQSVIAQAKR,ub,K,337,true,"Arabidopsis ubiquitination COFRADIC",40,26744219,"MaxQuant Score",91.6200000,1.0000000,,,,2.3829999918235E-5,0.1430000
AAESSYGEEAASDHQYGEVNHER,ph,S,535,true,"atm and atr DNA damage response",88,25561503,"MASCOT Score",50.0000000,0.9920000,,,,,-0.1500000
AAESSYGEEAASDHQYGEVNHER,ph,S,535,true,"TOR Kinase and ABA Receptor",100,29290610,XCorr,4.5109644,0.9386000,,,,0.00015259999781847,
AAESSYGEEAASDHQYGEVNHER,ph,S,535,true,"Lateral root-induction - NAA vs control",106,23328941,"MASCOT Score",47.0000000,,,,,,
AAESSYGEEAASDHQYGEVNHER,ph,S,535,true,"Col-0 callus - FC Col-0 vs. Col-0 Xray",111a,31410901,,33.4500000,,-0.7176053,0.0000000,NO,,1.1612326
AAESSYGEEAASDHQYGEVNHER,ph,S,535,true,"Col-0 X-ray callus - FC Col-0 vs. Col-0 Xray",111b,31410901,,33.4500000,,-0.7176053,0.0000000,NO,,1.1612326
AAESSYGEEAASDHQYGEVNHER,ph,S,535,true,"atm callus - FC atm vs. atm Xray",111c,31410901,,33.4500000,,-2.1274624,0.0000000,NO,,1.1612326
AAESSYGEEAASDHQYGEVNHER,ph,S,535,true,"atm-3 X-ray callus - FC atm vs. atm Xray",111d,31410901,,33.4500000,,-2.1274624,0.0000000,NO,,1.1612326
AAESSYGEEAASDHQYGEVNHER,ph,S,535,true,"Tissue atlas Arabidopsis - ProteomicsDB",114,32188942,"MaxQuant score",212.7700000,0.9953220,,,,0,
AAESSYGEEAASDHQYGEVNHER,ph,S,536,true,"Large-scale phosphorylation discovery",44,23111157,XCorr,4.3630000,,,,,,
AAESSYGEEAASDHQYGEVNHER,ph,S,536,true,"srk2dei ABA signaling phopshoproteomics",83,23572148,"MASCOT Score",78.0000000,,,,,,-0.0008000
AAESSYGEEAASDHQYGEVNHER,ph,S,536,true,"LAXIC - mannitol vs control",84b,23660473,XCorr,5.0400000,0.8540000,-1.0923758,,NO,4.4599998694217E-10,
AAESSYGEEAASDHQYGEVNHER,ph,S,536,true,"SnRK2 protein kinase substrates",85,23776212,XCorr,3.8401465,0.7970000,,,,0.0016138999490067,
AAESSYGEEAASDHQYGEVNHER,ph,S,536,true,"atm and atr DNA damage response",88,25561503,"MASCOT Score",47.0000000,0.8110000,,,,,-0.5200000
AAESSYGEEAASDHQYGEVNHER,ph,S,536,true,"Brassinosteroid-Regulated Phosphorylation Dynamics",94,26187819,"MaxQuant Score",80.7290000,0.8330000,,,,0.00031150001450442,0.7450000
AAESSYGEEAASDHQYGEVNHER,ph,S,536,true,"Lateral root-induction - NAA vs control",106,23328941,"MASCOT Score",27.0000000,,,,,,
AAESSYGEEAASDHQYGEVNHER,ph,S,536,true,"Phospho cell culture sucrose/TOR",109,30833711,,,0.9995550,,,,,
AAESSYGEEAASDHQYGEVNHER,ph,S,536,true,"Col-0 callus - FC Col-0 vs. Col-0 Xray",111a,31410901,,40.9800000,,1.7739699,0.0000000,NO,,0.8878328
AAESSYGEEAASDHQYGEVNHER,ph,S,536,true,"Col-0 X-ray callus - FC Col-0 vs. Col-0 Xray",111b,31410901,,40.9800000,,1.7739699,0.0000000,NO,,0.8878328
AAESSYGEEAASDHQYGEVNHER,ph,S,536,true,"atm callus - FC atm vs. atm Xray",111c,31410901,,40.9800000,,0.0027545,0.0000000,NO,,0.8878328
AAESSYGEEAASDHQYGEVNHER,ph,S,536,true,"atm-3 X-ray callus - FC atm vs. atm Xray",111d,31410901,,40.9800000,,0.0027545,0.0000000,NO,,0.8878328
AAESSYGEEAASDHQYGEVNHER,ph,S,536,true,"Tissue atlas Arabidopsis - ProteomicsDB",114,32188942,"MaxQuant score",220.9800000,0.9999700,,,,0,
AAESSYGEEAASDHQYGEVNHER,ph,Y,537,true,"LAXIC - mannitol vs control",84b,23660473,XCorr,5.0400000,0.8530000,,,,4.4599998694217E-10,
AAESSYGEEAASDHQYGEVNHER,ph,Y,537,true,"SnRK2 protein kinase substrates",85,23776212,XCorr,3.8401465,0.7970000,,,,0.0016138999490067,
AAESSYGEEAASDHQYGEVNHER,ph,Y,537,true,"Brassinosteroid-Regulated Phosphorylation Dynamics",94,26187819,"MaxQuant Score",61.1090000,0.8310000,,,,0.035000000149012,0.3620000
AAESSYGEEAASDHQYGEVNHER,ph,Y,537,true,"Lateral root-induction - NAA vs control",106,23328941,"MASCOT Score",23.0000000,,,,,,
AAESSYGEEAASDHQYGEVNHER,ph,Y,537,true,"Col-0 callus - FC Col-0 vs. Col-0 Xray",111a,31410901,,33.4500000,,-0.7176053,0.0000000,NO,,1.1612326
AAESSYGEEAASDHQYGEVNHER,ph,Y,537,true,"Col-0 X-ray callus - FC Col-0 vs. Col-0 Xray",111b,31410901,,33.4500000,,-0.7176053,0.0000000,NO,,1.1612326
AAESSYGEEAASDHQYGEVNHER,ph,Y,537,true,"atm callus - FC atm vs. atm Xray",111c,31410901,,33.4500000,,-2.1274624,0.0000000,NO,,1.1612326
AAESSYGEEAASDHQYGEVNHER,ph,Y,537,true,"atm-3 X-ray callus - FC atm vs. atm Xray",111d,31410901,,33.4500000,,-2.1274624,0.0000000,NO,,1.1612326
AAESSYGEEAASDHQYGEVNHER,ph,S,543,true,"Large-scale phosphorylation discovery",44,23111157,XCorr,4.2460000,,,,,,
AAESSYGEEAASDHQYGEVNHER,ph,S,543,true,"srk2dei ABA signaling phopshoproteomics",83,23572148,"MASCOT Score",78.0000000,,,,,,-0.0008000
AAESSYGEEAASDHQYGEVNHER,ph,S,543,true,"SnRK2 protein kinase substrates",85,23776212,XCorr,4.3020692,0.9060000,,,,7.2046597779263E-5,
AAESSYGEEAASDHQYGEVNHER,ph,S,543,true,"atm and atr DNA damage response",88,25561503,"MASCOT Score",76.0000000,1.0000000,,,,,0.0800000
AAESSYGEEAASDHQYGEVNHER,ph,S,543,true,"Brassinosteroid-Regulated Phosphorylation Dynamics",94,26187819,"MaxQuant Score",80.7290000,0.9970000,,,,0.00031150001450442,0.4590000
AAESSYGEEAASDHQYGEVNHER,ph,S,543,true,"TOR Kinase and ABA Receptor",100,29290610,XCorr,4.3326702,0.9717000,,,,4.9240002226725E-6,
AAESSYGEEAASDHQYGEVNHER,ph,S,543,true,"Lateral root-induction - NAA vs control",106,23328941,"MASCOT Score",46.0000000,,,,,,
AAESSYGEEAASDHQYGEVNHER,ph,S,543,true,"Phospho cell culture sucrose/TOR",109,30833711,,,1.0000000,,,,,
AAESSYGEEAASDHQYGEVNHER,ph,S,543,true,"Col-0 callus - FC Col-0 vs. Col-0 Xray",111a,31410901,,30.0200000,,1.0235809,0.0339092,YES,,1.0972844
AAESSYGEEAASDHQYGEVNHER,ph,S,543,true,"Col-0 X-ray callus - FC Col-0 vs. Col-0 Xray",111b,31410901,,30.0200000,,1.0235809,0.0339092,YES,,1.0972844
AAESSYGEEAASDHQYGEVNHER,ph,S,543,true,"atm callus - FC atm vs. atm Xray",111c,31410901,,30.0200000,,-0.4036996,0.3565652,NO,,1.0972844
AAESSYGEEAASDHQYGEVNHER,ph,S,543,true,"atm-3 X-ray callus - FC atm vs. atm Xray",111d,31410901,,30.0200000,,-0.4036996,0.3565652,NO,,1.0972844
AAESSYGEEAASDHQYGEVNHER,ph,S,543,true,"Tissue atlas Arabidopsis - ProteomicsDB",114,32188942,"MaxQuant score",251.5700000,1.0000000,,,,0,
AAESSYGEEAASDHQYGEVNHER,ph,Y,547,true,"srk2dei ABA signaling phopshoproteomics",83,23572148,"MASCOT Score",20.0000000,,,,,,-0.0004000
EWSGSSDRR,ph,S,573,true,"Tissue atlas Arabidopsis - ProteomicsDB",114,32188942,"MaxQuant score",124.8100000,1.0000000,,,,0.00016092399891932,
EWSGSSDRR,ph,S,576,true,"Tissue atlas Arabidopsis - ProteomicsDB",114,32188942,"MaxQuant score",111.5000000,0.8526390,,,,0.00035790700349025,
NREDKDAGYER,ub,K,584,true,"Arabidopsis ubiquitination COFRADIC",40,26744219,"MaxQuant Score",63.0910000,1.0000000,,,,0.0070000002160668,-0.0730000
DTDYGKR,ub,K,703,true,"Arabidopsis ubiquitination COFRADIC",40,26744219,"MaxQuant Score",86.8660000,1.0000000,,,,0.021999999880791,0.5540000
