Peptide,PTM,ModifiedAA,ModifiedPosition,PeptideUniqueToGene,ExperimentDesc,ExpID,PubmedID,ScoreType,IdentScore,LocProb,Log2FChange,PQ-val,QuantSig,PEP,MassErrorPPM
GEEDTKVIVEPTANGTSSL,nt,G,2,true,"Arg/N-end rule seed, prt6 vs. Wt",99,29168982,"MASCOT Score",25.9000000,,-0.3764090,0.4869451,NO,0.10339999943972,-1.9714531
GEEDTKVIVEPTAN,nt,G,2,true,"Arg/N-end rule seed, prt6 vs. Wt",99,29168982,"MASCOT Score",28.0400000,,-0.2519990,0.0369290,NO,0.015130000188947,0.2872418
VIVEPTANGTSSLQK,ph,S,19,true,"atm and atr DNA damage response",88,25561503,"MASCOT Score",47.0000000,0.9970000,,,,,1.0900000
VIVEPTANGTSSLQK,ph,S,19,true,"Tissue atlas Arabidopsis - ProteomicsDB",114,32188942,"MaxQuant score",217.7700000,0.9441060,,,,0,
TSDAISGK,ph,S,24,true,"atm and atr DNA damage response",88,25561503,"MASCOT Score",43.0000000,0.9490000,,,,,-2.1300000
TSDAISGKEVQENASGK,ph,S,28,true,"Tissue atlas Arabidopsis - ProteomicsDB",114,32188942,"MaxQuant score",112.9100000,0.9999930,,,,1.0878999923136E-8,
TSDAISGK,ph,S,28,true,"atm and atr DNA damage response",88,25561503,"MASCOT Score",31.0000000,1.0000000,,,,,-2.1300000
EVQENASGKEVQESK,ph,S,37,true,"Tissue atlas Arabidopsis - ProteomicsDB",114,32188942,"MaxQuant score",118.6600000,0.9999800,,,,9.1390802481328E-7,
MEIDDEGKQHEGESETGDKEVEVTEEEK,ph,S,68,true,"Phospho cell culture sucrose/TOR",109,30833711,,,0.9980720,,,,,
QHEGESETGDKEVEVTEEEKK,ph,S,68,true,"Tissue atlas Arabidopsis - ProteomicsDB",114,32188942,"MaxQuant score",192.2000000,0.9995350,,,,0,
QHEGESETGDKEVEVTEEEK,ph,S,68,true,"atm and atr DNA damage response",88,25561503,"MASCOT Score",38.0000000,1.0000000,,,,,-1.1700000
EQPEADKMDEDTDDKNLK,ph,T,101,true,"Tissue atlas Arabidopsis - ProteomicsDB",114,32188942,"MaxQuant score",70.1740000,1.0000000,,,,0.00027283499366604,
ADDGVSGVATEEDAVMK,ph,S,113,true,"srk2dei ABA signaling phopshoproteomics",83,23572148,"MASCOT Score",72.0000000,,,,,,-0.0026000
ADDGVSGVATEEDAVMK,ph,S,113,true,"atm and atr DNA damage response",88,25561503,"MASCOT Score",34.0000000,1.0000000,,,,,0.1600000
ADDGVSGVATEEDAVMK,ph,S,113,true,"TOR Kinase and ABA Receptor",100,29290610,XCorr,4.8298407,1.0000000,,,,1.9550000160962E-6,
ADDGVSGVATEEDAVMK,ph,S,113,true,"Phospho cell culture sucrose/TOR",109,30833711,,,0.9999940,,,,,
ADDGVSGVATEEDAVMK,ph,S,113,true,"Tissue atlas Arabidopsis - ProteomicsDB",114,32188942,"MaxQuant score",279.9300000,1.0000000,,,,0,
ADDGVSGVATEEDAVMK,ph,T,117,true,"Tissue atlas Arabidopsis - ProteomicsDB",114,32188942,"MaxQuant score",215.1500000,1.0000000,,,,0,
ESVESADNKDAENPEGEQEK,ph,S,126,true,"Tissue atlas Arabidopsis - ProteomicsDB",114,32188942,"MaxQuant score",158.0800000,0.7614500,,,,1.7331600051349E-28,
ESVESADNKDAENPEGEQEKESK,ph,S,129,true,"Tissue atlas Arabidopsis - ProteomicsDB",114,32188942,"MaxQuant score",225.2900000,1.0000000,,,,0,
ADDGVSGVATEEDAVMKESVESADNKDAENPEGEQEK,ub,K,133,true,"Ubiquitylome analysis innate immunity",124,33793954,,,,,,,,
LEGGKANGNEEGDTEEK,ac,K,155,true,"Quantitative Acetylproteomics",101,29440448,,,,,,,,
NEAELAEEEETNKGEEVK,ph,T,209,true,"Tissue atlas Arabidopsis - ProteomicsDB",114,32188942,"MaxQuant score",124.3100000,1.0000000,,,,4.3926799995824E-14,
EESMDDKEDEKEESNDDDK,ph,S,260,true,"TOR Kinase and ABA Receptor",100,29290610,XCorr,2.6724443,0.9999000,,,,0.036490000784397,
EDEKEESMDDKEDEK,ph,S,260,true,"TOR Kinase and ABA Receptor",100,29290610,XCorr,4.7484984,1.0000000,,,,4.3480000044838E-7,
EESMDDKEDEK,ph,S,260,true,"TOR Kinase and ABA Receptor",100,29290610,XCorr,2.7564905,1.0000000,,,,0.0074129998683929,
EESMDDKEDEKEESNDDDK,ph,S,271,true,"TOR Kinase and ABA Receptor",100,29290610,XCorr,3.2850020,0.9992000,,,,0.075199998915195,
GKGKTEKTR,ub,K,302,true,"Arabidopsis ubiquitination COFRADIC",40,26744219,"MaxQuant Score",79.6590000,0.9080000,,,,0.0020000000949949,0.4850000
GKGKTEKTR,ub,K,304,true,"Arabidopsis ubiquitination COFRADIC",40,26744219,"MaxQuant Score",104.8200000,1.0000000,,,,0.0010000000474975,0.1920000
GKGKTEKTR,ub,K,307,true,"Arabidopsis ubiquitination COFRADIC",40,26744219,"MaxQuant Score",104.8200000,1.0000000,,,,0.0010000000474975,0.1920000
TPFFSDRPVR,ph,T,325,true,"Tissue atlas Arabidopsis - ProteomicsDB",114,32188942,"MaxQuant score",136.3600000,1.0000000,,,,6.3050902099349E-7,
LVAVVDKDSSR,ub,K,348,true,"Arabidopsis ubiquitination COFRADIC",40,26744219,"MaxQuant Score",61.2130000,1.0000000,,,,0.00041690000216477,0.8140000
KSSPAAGSSSSK,ph,S,492,true,"atm and atr DNA damage response",88,25561503,"MASCOT Score",67.0000000,0.9940000,,,,,-2.2000000
KSSPAAGSSSSKR,ph,S,493,true,"SnRK2 protein kinase substrates",85,23776212,XCorr,2.6327806,0.8860000,,,,0.0049680699594319,
KSSPAAGSSSSK,ph,S,493,true,"SnRK2 protein kinase substrates",85,23776212,XCorr,2.8315697,0.9950000,,,,0.0012490600347519,
KSSPAAGSSSSK,ph,S,493,true,"atm and atr DNA damage response",88,25561503,"MASCOT Score",79.0000000,0.9960000,,,,,-2.2500000
SSPAAGSSSSKR,ph,S,499,true,"atm and atr DNA damage response",88,25561503,"MASCOT Score",20.0000000,0.9870000,,,,,-0.6400000
SSPAAGSSSSKR,ac,K,502,true,"Quantitative Acetylproteomics",101,29440448,,,,,,,,
SAKSQKKTEEATR,ub,K,506,true,"Arabidopsis ubiquitination COFRADIC",40,26744219,"MaxQuant Score",94.0070000,1.0000000,,,,0.00043809998896904,0.1450000
SAKSQKKTEEATR,ub,K,509,true,"Arabidopsis ubiquitination COFRADIC",40,26744219,"MaxQuant Score",94.0070000,1.0000000,,,,0.00043809998896904,0.1450000
SAKSQKKTEEATR,ub,K,510,true,"Arabidopsis ubiquitination COFRADIC",40,26744219,"MaxQuant Score",94.0070000,1.0000000,,,,0.00043809998896904,0.1450000
SVAHSDDESEEEKEDDEEEEK,ph,S,521,true,"Conserved plant phosphoproteome - Arabidopsis",61a,20466843,"MASCOT Score",40.0000000,1.0000000,,,,,
KSVAHSDDESEEEKEDDEEEEK,ph,S,525,true,"TOR Kinase and ABA Receptor",100,29290610,XCorr,6.1091585,0.9820000,,,,2.9119998998794E-6,
SVAHSDDESEEEKEDDEEEEK,ph,S,525,true,"STN8 phosphoproteome",38,21768351,"MASCOT Score",48.7700000,,,,,,
SVAHSDDESEEEKEDDEEEEK,ph,S,525,true,"Chloroplast kinase substrates",60,19376835,"MASCOT Score",38.4500000,,,,,,-0.9040720
SVAHSDDESEEEKEDDEEEEK,ph,S,525,true,"srk2dei ABA signaling phopshoproteomics",83,23572148,"MASCOT Score",47.0000000,,,,,,0.0019000
SVAHSDDESEEEKEDDEEEEK,ph,S,525,true,"Brassinosteroid-Regulated Phosphorylation Dynamics",94,26187819,"MaxQuant Score",88.8360000,0.9680000,,,,0.0020000000949949,-1.0790000
SVAHSDDESEEEKEDDEEEEK,ph,S,525,true,"TOR Kinase and ABA Receptor",100,29290610,XCorr,5.2851100,0.8695000,,,,4.9779998789745E-7,
SVAHSDDESEEEK,ph,S,525,true,"STN8 phosphoproteome",38,21768351,"MASCOT Score",43.5100000,,,,,,
SVAHSDDESEEEK,ph,S,525,true,"Chloroplast kinase substrates",60,19376835,"MASCOT Score",44.0200000,,,,,,-0.1943760
KSVAHSDDESEEEKEDDEEEEK,ph,S,529,true,"TOR Kinase and ABA Receptor",100,29290610,XCorr,6.1091585,0.9999000,,,,2.9119998998794E-6,
SVAHSDDESEEEKEDDEEEEK,ph,S,529,true,"Chloroplast kinase substrates",60,19376835,"MASCOT Score",38.4500000,,,,,,-0.9040720
SVAHSDDESEEEKEDDEEEEK,ph,S,529,true,"srk2dei ABA signaling phopshoproteomics",83,23572148,"MASCOT Score",47.0000000,,,,,,0.0019000
SVAHSDDESEEEKEDDEEEEK,ph,S,529,true,"Brassinosteroid-Regulated Phosphorylation Dynamics",94,26187819,"MaxQuant Score",88.8360000,1.0000000,,,,0.0020000000949949,-1.0790000
SVAHSDDESEEEKEDDEEEEK,ph,S,529,true,"TOR Kinase and ABA Receptor",100,29290610,XCorr,5.2851100,0.9999000,,,,4.9779998789745E-7,
SVAHSDDESEEEK,ph,S,529,true,"Chloroplast kinase substrates",60,19376835,"MASCOT Score",44.0200000,,,,,,-0.1943760
TSSDKKESAGKSR,ub,K,598,true,"Arabidopsis ubiquitination COFRADIC",40,26744219,"MaxQuant Score",76.7590000,0.9580000,,,,0.000328800000716,-0.2680000
TSSDKKESAGKSR,ub,K,603,true,"Arabidopsis ubiquitination COFRADIC",40,26744219,"MaxQuant Score",76.7590000,1.0000000,,,,0.000328800000716,-0.2680000
TAVPTKSSPPK,ph,S,615,true,"Tissue atlas Arabidopsis - ProteomicsDB",114,32188942,"MaxQuant score",142.8300000,0.8918570,,,,9.2599499623702E-8,
TAVPTKSSPPK,ph,S,616,true,"atm and atr DNA damage response",88,25561503,"MASCOT Score",32.0000000,0.9510000,,,,,-1.2500000
TAVPTKSSPPK,ph,S,616,true,"Tissue atlas Arabidopsis - ProteomicsDB",114,32188942,"MaxQuant score",169.1700000,0.9621120,,,,4.1442300979799E-12,
KKSDDDSDTSPK,ph,S,633,true,"SnRK2 protein kinase substrates",85,23776212,XCorr,4.1157756,1.0000000,,,,7.6594001974239E-11,
KKSDDDSDTSPK,ph,S,637,true,"SnRK2 protein kinase substrates",85,23776212,XCorr,2.8805070,0.9580000,,,,0.0001617560046725,
KSDDDSDTSPK,ph,S,637,true,"SnRK2 protein kinase substrates",85,23776212,XCorr,2.9464087,1.0000000,,,,0.005654530134052,
KSDDDSDTSPK,ph,S,637,true,"atm and atr DNA damage response",88,25561503,"MASCOT Score",46.0000000,1.0000000,,,,,0.6400000
SDDDSDTSPK,ph,S,637,true,"SnRK2 protein kinase substrates",85,23776212,XCorr,2.9381835,0.9990000,,,,0.017622100189328,
SDDDSDTSPK,ph,S,637,true,"atm and atr DNA damage response",88,25561503,"MASCOT Score",48.0000000,1.0000000,,,,,-1.1300000
EQAAAPLKSVSK,ph,S,664,true,"Tissue atlas Arabidopsis - ProteomicsDB",114,32188942,"MaxQuant score",149.6000000,0.9865410,,,,1.2189600511192E-6,
SVSKEKPVIGK,ph,S,666,true,"Tissue atlas Arabidopsis - ProteomicsDB",114,32188942,"MaxQuant score",106.1400000,0.9980060,,,,1.4189899957273E-5,
EKPVIGKR,ac,K,674,true,"Quantitative Acetylproteomics",101,29440448,,,,,,,,
AKGSGGGEEVKA,ph,S,770,true,"atm and atr DNA damage response",88,25561503,"MASCOT Score",32.0000000,1.0000000,,,,,-1.8100000
AKGSGGGEEVKA,ph,S,770,true,"Tissue atlas Arabidopsis - ProteomicsDB",114,32188942,"MaxQuant score",97.0730000,1.0000000,,,,0.00093212199863046,
