Peptide,PTM,ModifiedAA,ModifiedPosition,PeptideUniqueToGene,ExperimentDesc,ExpID,PubmedID,ScoreType,IdentScore,LocProb,Log2FChange,PQ-val,QuantSig,PEP,MassErrorPPM
RHASPIHLMSPVHGGGGR,ph,S,94,true,"TOR Kinase and ABA Receptor",100,29290610,XCorr,3.5888462,0.9999000,,,,0.00010840000322787,
HASPIHLMSPVHGGGGR,ph,S,94,true,"atm and atr DNA damage response",88,25561503,"MASCOT Score",49.0000000,1.0000000,,,,,-0.2400000
HASPIHLMSPVHGGGGR,ph,S,94,true,"Tissue atlas Arabidopsis - ProteomicsDB",114,32188942,"MaxQuant score",155.1600000,1.0000000,,,,1.7093299576137E-16,
RHASPIHLMSPVHGGGGR,ph,S,100,true,"TOR Kinase and ABA Receptor",100,29290610,XCorr,3.0331860,1.0000000,,,,0.0022940000053495,
HASPIHLMSPVHGGGGR,ph,S,100,true,"atm and atr DNA damage response",88,25561503,"MASCOT Score",43.0000000,1.0000000,,,,,-0.2100000
HASPIHLMSPVHGGGGR,ph,S,100,true,"Tissue atlas Arabidopsis - ProteomicsDB",114,32188942,"MaxQuant score",126.5100000,1.0000000,,,,5.6465099262937E-10,
EISPVSNIRSPLASGVNYGGGSNR,ph,S,191,true,"Tissue atlas Arabidopsis - ProteomicsDB",114,32188942,"MaxQuant score",160.0700000,1.0000000,,,,0,
SPLASGVNYGGGSNR,ph,S,198,true,"Tissue atlas Arabidopsis - ProteomicsDB",114,32188942,"MaxQuant score",235.9500000,1.0000000,,,,0,
SPLASGVNYGGGSNR,ph,S,210,true,"Tissue atlas Arabidopsis - ProteomicsDB",114,32188942,"MaxQuant score",137.3000000,0.9993870,,,,4.2116300745953E-21,
RFSPVIGSGR,ph,S,240,true,"atm and atr DNA damage response",88,25561503,"MASCOT Score",26.0000000,0.9200000,,,,,-0.2200000
RFSPVIGSGR,ph,S,240,true,"TOR Kinase and ABA Receptor",100,29290610,XCorr,3.2253366,1.0000000,,,,0.01465000025928,
RFSPVIGSGR,ph,S,240,true,"Tissue atlas Arabidopsis - ProteomicsDB",114,32188942,"MaxQuant score",195.1600000,1.0000000,,,,7.1175602575375E-14,
IPSNPYFNGASPNR,ph,S,291,true,"Pollen phosphoproteome Arabidopsis",43,22631563,"MASCOT Score",62.0600000,,,,,,
IPSNPYFNGASPNR,ph,S,291,true,"Lateral root-induction - NAA vs control",106,23328941,"MASCOT Score",48.0000000,,,,,,
IPSNPYFNGASPNR,ph,S,291,true,"Tissue atlas Arabidopsis - ProteomicsDB",114,32188942,"MaxQuant score",224.3600000,1.0000000,,,,0,
YTSPIGHNR,ph,S,297,true,"atm and atr DNA damage response",88,25561503,"MASCOT Score",24.0000000,0.9520000,,,,,-0.1200000
YTSPIGHNR,ph,S,297,true,"Tissue atlas Arabidopsis - ProteomicsDB",114,32188942,"MaxQuant score",133.9900000,0.9999900,,,,0.00010668500181055,
NYGTSSGLSSSPFNGFEGSIGELYR,og,S,362,true,"O-GlcNac Inflorescence Tissue",81,28154133,"MASCOT Score",33.5000000,,,,,,4.1000000
GGSVYSDSTWQQQQLPSQSSHELDNLSR,ph,S,385,true,"Tissue atlas Arabidopsis - ProteomicsDB",114,32188942,"MaxQuant score",162.3800000,0.9989340,,,,0,
