Peptide,PTM,ModifiedAA,ModifiedPosition,PeptideUniqueToGene,ExperimentDesc,ExpID,PubmedID,ScoreType,IdentScore,LocProb,Log2FChange,PQ-val,QuantSig,PEP,MassErrorPPM
NSNTAATTNRPSPINNAMR,ph,S,44,true,"Tissue atlas Arabidopsis - ProteomicsDB",114,32188942,"MaxQuant score",137.5200000,0.9993080,,,,5.4774401973736E-16,
SSPPMRSPLTSPNR,ph,S,66,true,"Tissue atlas Arabidopsis - ProteomicsDB",114,32188942,"MaxQuant score",54.7680000,0.9179760,,,,0.0021886599715799,
SPLTSPNR,ph,S,70,true,"Tissue atlas Arabidopsis - ProteomicsDB",114,32188942,"MaxQuant score",169.9900000,0.9934550,,,,0.00051864102715626,
STLKSPLRDDR,ph,S,101,true,"srk2dei ABA signaling phopshoproteomics",83,23572148,"MASCOT Score",33.0000000,,,,,,-0.0009000
STLKSPLRDDR,ph,S,101,true,"atm and atr DNA damage response",88,25561503,"MASCOT Score",25.0000000,0.9920000,,,,,-0.5500000
STLKSPLRDDR,ph,S,101,true,"Phospho cell culture sucrose/TOR",109,30833711,,,0.9999810,,,,,
STLKSPLRDDR,ph,S,101,true,"Tissue atlas Arabidopsis - ProteomicsDB",114,32188942,"MaxQuant score",134.1400000,0.9999970,,,,9.0052702717003E-7,
STLKSPLR,ph,S,101,true,"atm and atr DNA damage response",88,25561503,"MASCOT Score",26.0000000,0.9960000,,,,,-1.6900000
APSVSKSDDEDSEDDKPLSAR,ph,S,122,true,"LAXIC - mannitol vs control",84b,23660473,XCorr,4.1100000,0.8950000,,,,0.00041881398647092,
APSVSKSDDEDSEDDKPLSAR,ph,S,124,true,"srk2dei ABA signaling phopshoproteomics",83,23572148,"MASCOT Score",58.0000000,,,,,,-0.0002000
APSVSKSDDEDSEDDKPLSAR,ph,S,124,true,"Tissue atlas Arabidopsis - ProteomicsDB",114,32188942,"MaxQuant score",90.5450000,0.8519560,,,,2.7698599751602E-6,
APSVSKSDDEDSEDDKPLSAR,ph,S,126,true,"srk2dei ABA signaling phopshoproteomics",83,23572148,"MASCOT Score",99.0000000,,,,,,-0.0017000
APSVSKSDDEDSEDDKPLSAR,ph,S,126,true,"SnRK2 protein kinase substrates",85,23776212,XCorr,4.3330116,0.9990000,,,,4.1755899360396E-7,
APSVSKSDDEDSEDDKPLSAR,ph,S,126,true,"Brassinosteroid-Regulated Phosphorylation Dynamics",94,26187819,"MaxQuant Score",122.4400000,0.8100000,,,,1.4550000315694E-8,1.4730000
APSVSKSDDEDSEDDKPLSAR,ph,S,126,true,"Phospho cell culture sucrose/TOR",109,30833711,,,1.0000000,,,,,
APSVSKSDDEDSEDDKPLSAR,ph,S,126,true,"Col-0 callus - FC Col-0 vs. Col-0 Xray",111a,31410901,,30.2300000,,0.2192228,0.0000000,NO,,1.1923481
APSVSKSDDEDSEDDKPLSAR,ph,S,126,true,"Col-0 X-ray callus - FC Col-0 vs. Col-0 Xray",111b,31410901,,30.2300000,,0.2192228,0.0000000,NO,,1.1923481
APSVSKSDDEDSEDDKPLSAR,ph,S,126,true,"atm callus - FC atm vs. atm Xray",111c,31410901,,30.2300000,,0.3150310,0.0000000,NO,,1.1923481
APSVSKSDDEDSEDDKPLSAR,ph,S,126,true,"atm-3 X-ray callus - FC atm vs. atm Xray",111d,31410901,,30.2300000,,0.3150310,0.0000000,NO,,1.1923481
SDDEDSEDDKPLSAR,ph,S,126,true,"TOR Kinase and ABA Receptor",100,29290610,XCorr,3.3227601,1.0000000,,,,0.016359999775887,
SDDEDSEDDKPLSAR,ph,S,126,true,"Tissue atlas Arabidopsis - ProteomicsDB",114,32188942,"MaxQuant score",281.5900000,1.0000000,,,,0,
APSVSKSDDEDSEDDKPLSAR,ph,S,131,true,"srk2dei ABA signaling phopshoproteomics",83,23572148,"MASCOT Score",99.0000000,,,,,,-0.0017000
APSVSKSDDEDSEDDKPLSAR,ph,S,131,true,"LAXIC - mannitol vs control",84b,23660473,XCorr,4.1100000,0.7560000,,,,0.00041881398647092,
APSVSKSDDEDSEDDKPLSAR,ph,S,131,true,"SnRK2 protein kinase substrates",85,23776212,XCorr,4.3330116,1.0000000,,,,4.1755899360396E-7,
APSVSKSDDEDSEDDKPLSAR,ph,S,131,true,"Brassinosteroid-Regulated Phosphorylation Dynamics",94,26187819,"MaxQuant Score",122.4400000,1.0000000,,,,1.4550000315694E-8,1.4110000
APSVSKSDDEDSEDDKPLSAR,ph,S,131,true,"Col-0 callus - FC Col-0 vs. Col-0 Xray",111a,31410901,,30.2300000,,0.2192228,0.0000000,NO,,1.1923481
APSVSKSDDEDSEDDKPLSAR,ph,S,131,true,"Col-0 X-ray callus - FC Col-0 vs. Col-0 Xray",111b,31410901,,30.2300000,,0.2192228,0.0000000,NO,,1.1923481
APSVSKSDDEDSEDDKPLSAR,ph,S,131,true,"atm callus - FC atm vs. atm Xray",111c,31410901,,30.2300000,,0.3150310,0.0000000,NO,,1.1923481
APSVSKSDDEDSEDDKPLSAR,ph,S,131,true,"atm-3 X-ray callus - FC atm vs. atm Xray",111d,31410901,,30.2300000,,0.3150310,0.0000000,NO,,1.1923481
SDDEDSEDDKPLSAR,ph,S,131,true,"SnRK2 protein kinase substrates",85,23776212,XCorr,3.5000956,1.0000000,,,,0.001706050010398,
SDDEDSEDDKPLSAR,ph,S,131,true,"atm and atr DNA damage response",88,25561503,"MASCOT Score",35.0000000,1.0000000,,,,,0.6700000
SDDEDSEDDKPLSAR,ph,S,131,true,"TOR Kinase and ABA Receptor",100,29290610,XCorr,3.3227601,0.9966000,,,,0.016359999775887,
SDDEDSEDDKPLSAR,ph,S,131,true,"Tissue atlas Arabidopsis - ProteomicsDB",114,32188942,"MaxQuant score",281.5900000,1.0000000,,,,0,
ANQATVKEDNSDGDDHVPIASR,ph,S,301,true,"Arabidopsis root NAA phosphoproteome",18a,27643528,"MaxQuant Score",82.6390000,0.9890000,,,,1.9730000744289E-8,-0.1750000
ANQATVKEDNSDGDDHVPIASR,ph,S,301,true,"SnRK2 protein kinase substrates",85,23776212,XCorr,3.6431229,0.9990000,,,,0.001716690021567,
ANQATVKEDNSDGDDHVPIASR,ph,S,301,true,"atm and atr DNA damage response",88,25561503,"MASCOT Score",53.0000000,1.0000000,,,,,-0.5900000
ANQATVKEDNSDGDDHVPIASR,ph,S,301,true,"Protein sumoylation and phosphorylation cross-talk",97,28419593,,,,,,,,
ANQATVKEDNSDGDDHVPIASR,ph,S,301,true,"Touch-induced phosphorylation: 40s touch vs untouc",136,30291188,"MASCOT score",77.3700000,,0.0041804,0.9853140,NO,,1.2924993
EDNSDGDDHVPIASR,ph,S,301,true,"STN8 phosphoproteome",38,21768351,"MASCOT Score",54.0300000,,,,,,-1.3939300
EDNSDGDDHVPIASR,ph,S,301,true,"Chloroplast kinase substrates",60,19376835,"MASCOT Score",61.2100000,,,,,,-0.2344610
EDNSDGDDHVPIASR,ph,S,301,true,"LAXIC - mannitol vs control",84b,23660473,XCorr,2.6600000,0.9000000,,,,0.05069449916482,
EDNSDGDDHVPIASR,ph,S,301,true,"atm and atr DNA damage response",88,25561503,"MASCOT Score",76.0000000,1.0000000,,,,,0.5900000
EDNSDGDDHVPIASR,ph,S,301,true,"TOR Kinase and ABA Receptor",100,29290610,XCorr,2.4336479,1.0000000,,,,0.0018700000364333,
EDNSDGDDHVPIASR,ph,S,301,true,"Phospho cell culture sucrose/TOR",109,30833711,,,1.0000000,,,,,
EDNSDGDDHVPIASR,ph,S,301,true,"Tissue atlas Arabidopsis - ProteomicsDB",114,32188942,"MaxQuant score",307.9200000,1.0000000,,,,0,
TPLMGSDGKR,ph,S,821,true,"Tissue atlas Arabidopsis - ProteomicsDB",114,32188942,"MaxQuant score",55.2320000,0.9999790,,,,0.0046035801060498,
NLTPEALEK,ph,T,830,true,"Tissue atlas Arabidopsis - ProteomicsDB",114,32188942,"MaxQuant score",145.4600000,1.0000000,,,,0.00031403699540533,
