Peptide,PTM,ModifiedAA,ModifiedPosition,PeptideUniqueToGene,ExperimentDesc,ExpID,PubmedID,ScoreType,IdentScore,LocProb,Log2FChange,PQ-val,QuantSig,PEP,MassErrorPPM
AVTDTESPHLGE,nt,A,2,true,"N-terminal ChaFRADIC",92,26010716,"MASCOT Score",32.4800000,,,,,2.5570000161679E-6,
AVTDTESPHLGE,nt,A,2,true,"Arg/N-end rule seed, prt6 vs. Wt",99,29168982,"MASCOT Score",43.7200000,,-1.4199155,0.0030765,YES,0.00099019997287542,-0.6467598
AVTDTESPHLGE,nt,A,2,true,"HUNTER N-terminome: legumain, GluC and trypsin",119,31951383,"MaxQuant score",126.3100000,,,,,,
AVTDTESPHLGE,nt,A,2,true,"Arabidopsis translation initiation landscape - NT",167b,35069635,,,,,,,,
AVTDTESPH,nt,A,2,true,"Arg/N-end rule seed, prt6 vs. Wt",99,29168982,"MASCOT Score",61.4400000,,-0.1895593,0.1053168,NO,0.021409999579191,-0.9579177
AVTDTESPHLGE,nta,A,2,true,"HUNTER N-terminome: legumain, GluC and trypsin",119,31951383,"MaxQuant score",111.7400000,,,,,,
AVTDTESPHLGEITCGTLLEK,ph,T,4,true,"srk2dei ABA signaling phopshoproteomics",83,23572148,"MASCOT Score",34.0000000,,,,,,-0.0013000
AVTDTESPHLGEITCGTLLEK,ph,T,4,true,"Tissue atlas Arabidopsis - ProteomicsDB",114,32188942,"MaxQuant score",287.5500000,0.9999940,,,,0,
AVTDTESPHLGEITCGTLLEK,ph,T,6,true,"Lateral root-induction - NAA vs control",106,23328941,"MASCOT Score",41.0000000,,,,,,
AVTDTESPHLGEITCGTLLEK,ph,S,8,true,"PAMP-triggered phosphorylation",48,24601666,"MASCOT Score",28.5600000,,,,,,
AVTDTESPHLGEITCGTLLEK,ph,S,8,true,"srk2dei ABA signaling phopshoproteomics",83,23572148,"MASCOT Score",78.0000000,,,,,,0.0021000
AVTDTESPHLGEITCGTLLEK,ph,S,8,true,"Protein sumoylation and phosphorylation cross-talk",97,28419593,,,,,,,,
AVTDTESPHLGEITCGTLLEK,ph,S,8,true,"Lateral root-induction - NAA vs control",106,23328941,"MASCOT Score",22.0000000,,,,,,
AVTDTESPHLGEITCGTLLEK,ph,S,8,true,"Col-0 callus - FC Col-0 vs. Col-0 Xray",111a,31410901,,90.4200000,,1.0874291,0.0000000,NO,,0.9951287
AVTDTESPHLGEITCGTLLEK,ph,S,8,true,"Col-0 X-ray callus - FC Col-0 vs. Col-0 Xray",111b,31410901,,90.4200000,,1.0874291,0.0000000,NO,,0.9951287
AVTDTESPHLGEITCGTLLEK,ph,S,8,true,"atm callus - FC atm vs. atm Xray",111c,31410901,,90.4200000,,3.9823480,0.0000000,NO,,0.9951287
AVTDTESPHLGEITCGTLLEK,ph,S,8,true,"atm-3 X-ray callus - FC atm vs. atm Xray",111d,31410901,,90.4200000,,3.9823480,0.0000000,NO,,0.9951287
AVTDTESPHLGEITCGTLLEK,ph,S,8,true,"Tissue atlas Arabidopsis - ProteomicsDB",114,32188942,"MaxQuant score",437.0900000,1.0000000,,,,0,
AVTDTESPHLGEITCGTLLEK,ph,T,15,true,"srk2dei ABA signaling phopshoproteomics",83,23572148,"MASCOT Score",27.0000000,,,,,,0.0010000
AVTDTESPHLGEITCGTLLEK,ph,T,18,true,"srk2dei ABA signaling phopshoproteomics",83,23572148,"MASCOT Score",27.0000000,,,,,,0.0010000
LQEIWDEVGESDDERDK,ph,S,33,true,"Tyrosine phosphorylation in Arabidopsis",59,18463617,"MASCOT Score",68.0000000,,,,,,-1.1205127
LQEIWDEVGESDDERDK,ph,S,33,true,"srk2dei ABA signaling phopshoproteomics",83,23572148,"MASCOT Score",84.0000000,,,,,,-0.0003000
LQEIWDEVGESDDERDK,ph,S,33,true,"LAXIC - mannitol vs control",84b,23660473,XCorr,3.3800000,1.0000000,,,,9.8800001069321E-6,
LQEIWDEVGESDDERDK,ph,S,33,true,"SnRK2 protein kinase substrates",85,23776212,XCorr,3.9214249,1.0000000,,,,8.056209865881E-11,
LQEIWDEVGESDDERDK,ph,S,33,true,"TOR Kinase and ABA Receptor",100,29290610,XCorr,4.9426150,1.0000000,,,,1.9769999198616E-5,
LQEIWDEVGESDDERDK,ph,S,33,true,"Phospho cell culture sucrose/TOR",109,30833711,,,1.0000000,,,,,
LQEIWDEVGESDDERDK,ph,S,33,true,"Tissue atlas Arabidopsis - ProteomicsDB",114,32188942,"MaxQuant score",311.8700000,1.0000000,,,,0,
LQEIWDEVGESDDER,ph,S,33,true,"STN8 phosphoproteome",38,21768351,"MASCOT Score",101.2500000,,,,,,-2.0067500
LQEIWDEVGESDDER,ph,S,33,true,"SnRK2 protein kinase substrates",85,23776212,XCorr,2.8487372,1.0000000,,,,2.0940999093E-5,
SLVGIPDKSSGTIK,ac,K,95,true,"Quantitative Acetylproteomics",101,29440448,,,,,,,,
DIAGGLSNE,nt,D,138,true,"Arg/N-end rule seed, prt6 vs. Wt",99,29168982,"MASCOT Score",49.0500000,,-0.1658005,0.1853555,NO,0.0013539999490604,-1.1698163
KVQEQPHVEQESAFSTRPSPARPVSAK,ph,S,503,true,"PAMP-triggered phosphorylation",48,24601666,"MASCOT Score",37.8200000,,,,,,
VQEQPHVEQESAFSTRPSPARPVSAK,ph,S,503,true,"PAMP-triggered phosphorylation",48,24601666,"MASCOT Score",29.3200000,,,,,,
VQEQPHVEQESAFSTRPSPARPVSAK,ph,S,503,true,"atm and atr DNA damage response",88,25561503,"MASCOT Score",44.0000000,0.9990000,,,,,-0.1800000
VQEQPHVEQESAFSTRPSPARPVSAK,ph,S,503,true,"TOR Kinase and ABA Receptor",100,29290610,XCorr,5.2933283,0.9597000,,,,0.0016830000095069,
VQEQPHVEQESAFSTRPSPARPVSAK,ph,S,503,true,"Tissue atlas Arabidopsis - ProteomicsDB",114,32188942,"MaxQuant score",244.4400000,0.9870430,,,,0,
KVQEQPHVEQESAFSTRPSPARPVSAKK,ph,S,509,true,"PAMP-triggered phosphorylation",48,24601666,"MASCOT Score",33.1100000,,,,,,
KVQEQPHVEQESAFSTRPSPARPVSAK,ph,S,509,true,"PAMP-triggered phosphorylation",48,24601666,"MASCOT Score",37.3400000,,,,,,
VQEQPHVEQESAFSTRPSPARPVSAK,ph,S,509,true,"TOR Kinase and ABA Receptor",100,29290610,XCorr,5.2933283,0.9998000,,,,0.0016830000095069,
PSPARPVSAK,ph,S,509,false,"atm and atr DNA damage response",88,25561503,"MASCOT Score",31.0000000,1.0000000,,,,,-1.3200000
PSPARPVSAK,ph,S,509,false,"Phospho cell culture sucrose/TOR",109,30833711,,,0.9998860,,,,,
PSPARPVSAK,ph,S,509,false,"Tissue atlas Arabidopsis - ProteomicsDB",114,32188942,"MaxQuant score",153.9600000,1.0000000,,,,0,
RLSLNANQNGSR,ph,S,532,true,"Chloroplast kinase substrates",60,19376835,"MASCOT Score",35.0000000,,,,,,-0.8282450
RLSLNANQNGSR,ph,S,532,true,"srk2dei ABA signaling phopshoproteomics",83,23572148,"MASCOT Score",36.0000000,,,,,,-0.0003000
RLSLNANQNGSR,ph,S,532,true,"atm and atr DNA damage response",88,25561503,"MASCOT Score",64.0000000,1.0000000,,,,,-0.5500000
RLSLNANQNGSR,ph,S,532,true,"TOR Kinase and ABA Receptor",100,29290610,XCorr,2.9530919,0.9956000,,,,0.012989999726415,
RLSLNANQNGSR,ph,S,532,true,"Col-0 callus - FC Col-0 vs. Col-0 Xray",111a,31410901,,51.5000000,,-1.1487860,0.0000000,NO,,-0.0688329
RLSLNANQNGSR,ph,S,532,true,"Col-0 X-ray callus - FC Col-0 vs. Col-0 Xray",111b,31410901,,51.5000000,,-1.1487860,0.0000000,NO,,-0.0688329
RLSLNANQNGSR,ph,S,532,true,"atm callus - FC atm vs. atm Xray",111c,31410901,,51.5000000,,-0.3314688,0.0000000,NO,,-0.0688329
RLSLNANQNGSR,ph,S,532,true,"atm-3 X-ray callus - FC atm vs. atm Xray",111d,31410901,,51.5000000,,-0.3314688,0.0000000,NO,,-0.0688329
RLSLNANQNGSR,ph,S,532,true,"Tissue atlas Arabidopsis - ProteomicsDB",114,32188942,"MaxQuant score",144.2900000,1.0000000,,,,1.0818699820447E-6,
LSLNANQNGSR,ph,S,540,true,"atm and atr DNA damage response",88,25561503,"MASCOT Score",46.0000000,1.0000000,,,,,-1.1000000
LSLNANQNGSR,ph,S,540,true,"Tissue atlas Arabidopsis - ProteomicsDB",114,32188942,"MaxQuant score",108.2300000,1.0000000,,,,0.00082817999646068,
RETLNRPAAPTNYVAISK,ph,T,552,true,"atm and atr DNA damage response",88,25561503,"MASCOT Score",36.0000000,1.0000000,,,,,-0.2800000
RETLNRPAAPTNYVAISK,ph,T,552,true,"Tissue atlas Arabidopsis - ProteomicsDB",114,32188942,"MaxQuant score",151.4200000,1.0000000,,,,8.2543096012136E-18,
EEAASSPVSGAADHQVPASP,ph,S,572,true,"srk2dei ABA signaling phopshoproteomics",83,23572148,"MASCOT Score",59.0000000,,,,,,-0.0009000
EEAASSPVSGAADHQVPASP,ph,S,572,true,"SnRK2 protein kinase substrates",85,23776212,XCorr,3.7876832,0.9030000,,,,2.7287899939665E-8,
EEAASSPVSGAADHQVPASP,ph,S,572,true,"Tissue atlas Arabidopsis - ProteomicsDB",114,32188942,"MaxQuant score",139.0200000,0.7856390,,,,1.008580048611E-21,
ETLNRPAAPTNYVAISKEEAASSPVSGAADHQVPASP,ph,S,573,true,"MAPK Arabidopsis substrates",45,23172892,"MaxQuant Score",50.0990000,,,,,,
EEAASSPVSGAADHQVPASP,ph,S,573,true,"srk2dei ABA signaling phopshoproteomics",83,23572148,"MASCOT Score",44.0000000,,,,,,0.0009000
EEAASSPVSGAADHQVPASP,ph,S,573,true,"LAXIC - mannitol vs control",84b,23660473,XCorr,3.4700000,0.8870000,-1.0305523,,NO,4.5699998452164E-8,
EEAASSPVSGAADHQVPASP,ph,S,573,true,"Tissue atlas Arabidopsis - ProteomicsDB",114,32188942,"MaxQuant score",265.2700000,0.9971000,,,,0,
EEAASSPVSGAADHQVPASP,ph,S,576,true,"Tissue atlas Arabidopsis - ProteomicsDB",114,32188942,"MaxQuant score",119.0100000,0.9999980,,,,7.135950142706E-19,
ETLNRPAAPTNYVAISKEEAASSPVSGAADHQVPASP,ph,S,586,true,"MAPK Arabidopsis substrates",45,23172892,"MaxQuant Score",50.0990000,,,,,,
ETLNRPAAPTNYVAISKEEAASSPVSGAADHQVPASP,ph,S,586,true,"PAMP-triggered phosphorylation",48,24601666,"MASCOT Score",41.9800000,,,,,,
ETLNRPAAPTNYVAISKEEAASSPVSGAADHQVPASP,ph,S,586,true,"Tissue atlas Arabidopsis - ProteomicsDB",114,32188942,"MaxQuant score",399.9000000,1.0000000,,,,0,
EEAASSPVSGAADHQVPASP,ph,S,586,true,"Arabidopsis root NAA phosphoproteome",18a,27643528,"MaxQuant Score",114.9200000,1.0000000,,,,1.6150000010938E-17,0.6010000
EEAASSPVSGAADHQVPASP,ph,S,586,true,"Phosphorylation nuclei-enriched fractions",28,19245862,,,,,,,,
EEAASSPVSGAADHQVPASP,ph,S,586,true,"STN8 phosphoproteome",38,21768351,"MASCOT Score",83.4800000,,,,,,-1.7538400
EEAASSPVSGAADHQVPASP,ph,S,586,true,"Phosphoproteomic analysis of seed maturation",42,22440515,"MASCOT Score",41.0000000,,,,,,-2.0200000
EEAASSPVSGAADHQVPASP,ph,S,586,true,"PAMP-triggered phosphorylation",48,24601666,"MASCOT Score",48.6200000,,,,,,
EEAASSPVSGAADHQVPASP,ph,S,586,true,"Tyrosine phosphorylation in Arabidopsis",59,18463617,"MASCOT Score",45.0000000,,,,,,-0.7553497
EEAASSPVSGAADHQVPASP,ph,S,586,true,"Chloroplast kinase substrates",60,19376835,"MASCOT Score",86.9100000,,,,,,-0.9590170
EEAASSPVSGAADHQVPASP,ph,S,586,true,"BSK8 and BSL2 regulating sucrose-ph synthase",66,24924143,"MaxQuant Score",96.8810000,,,,,,0.9394600
EEAASSPVSGAADHQVPASP,ph,S,586,true,"srk2dei ABA signaling phopshoproteomics",83,23572148,"MASCOT Score",70.0000000,,,,,,-0.0014000
EEAASSPVSGAADHQVPASP,ph,S,586,true,"LAXIC - ABA stress",84a,23660473,XCorr,4.5600000,1.0000000,,,,0.0001755410048645,
EEAASSPVSGAADHQVPASP,ph,S,586,true,"LAXIC - mannitol vs control",84b,23660473,XCorr,3.9400000,1.0000000,-1.0305523,,NO,1.2499999684223E-6,
EEAASSPVSGAADHQVPASP,ph,S,586,true,"SnRK2 protein kinase substrates",85,23776212,XCorr,3.7876832,1.0000000,,,,2.7287899939665E-8,
EEAASSPVSGAADHQVPASP,ph,S,586,true,"SIRK1 phosphorylation",86a,23820729,"MaxQuant Score",156.8900000,1.0000000,,,,0.0040000001899898,1.6700000
EEAASSPVSGAADHQVPASP,ph,S,586,true,"SIRK1 exp - sirk1 mutant vs WT",86b,23820729,,,,-0.8462476,,NO,,
EEAASSPVSGAADHQVPASP,ph,S,586,true,"SIRK1 exp - 35S:SIRK1 vs WT",86c,23820729,,,,-0.2708867,,NO,,
EEAASSPVSGAADHQVPASP,ph,S,586,true,"atm and atr DNA damage response",88,25561503,"MASCOT Score",99.0000000,1.0000000,,,,,-0.6300000
EEAASSPVSGAADHQVPASP,ph,S,586,true,"Brassinosteroid-Regulated Phosphorylation Dynamics",94,26187819,"MaxQuant Score",235.2500000,1.0000000,,,,0,0.6940000
EEAASSPVSGAADHQVPASP,ph,S,586,true,"Protein sumoylation and phosphorylation cross-talk",97,28419593,,,,,,,,
EEAASSPVSGAADHQVPASP,ph,S,586,true,"TOR Kinase and ABA Receptor",100,29290610,XCorr,4.7549992,1.0000000,,,,2.4990001179503E-7,
EEAASSPVSGAADHQVPASP,ph,S,586,true,"Lateral root-induction - NAA vs control",106,23328941,"MASCOT Score",45.0000000,,,,,,
EEAASSPVSGAADHQVPASP,ph,S,586,true,"Phospho cell culture sucrose/TOR",109,30833711,,,1.0000000,,,,,
EEAASSPVSGAADHQVPASP,ph,S,586,true,"Col-0 callus - FC Col-0 vs. Col-0 Xray",111a,31410901,,46.6000000,,-0.0314641,0.0000000,NO,,1.3025943
EEAASSPVSGAADHQVPASP,ph,S,586,true,"Col-0 X-ray callus - FC Col-0 vs. Col-0 Xray",111b,31410901,,46.6000000,,-0.0314641,0.0000000,NO,,1.3025943
EEAASSPVSGAADHQVPASP,ph,S,586,true,"atm callus - FC atm vs. atm Xray",111c,31410901,,46.6000000,,-0.2309409,0.0000000,NO,,1.3025943
EEAASSPVSGAADHQVPASP,ph,S,586,true,"atm-3 X-ray callus - FC atm vs. atm Xray",111d,31410901,,46.6000000,,-0.2309409,0.0000000,NO,,1.3025943
EEAASSPVSGAADHQVPASP,ph,S,586,true,"Touch-induced phosphorylation: 40s touch vs untouc",136,30291188,"MASCOT score",65.1600000,,-0.0458756,0.1501417,NO,,4.6431895
