Peptide,PTM,ModifiedAA,ModifiedPosition,PeptideUniqueToGene,ExperimentDesc,ExpID,PubmedID,ScoreType,IdentScore,LocProb,Log2FChange,PQ-val,QuantSig,PEP,MassErrorPPM
ALPNQQTVDYPSFKL,nt,A,2,false,"Arg/N-end rule seed, prt6 vs. Wt",99,29168982,"MASCOT Score",54.5300000,,,,,0.015639999881387,-2.0931573
ALPNQQTVDYPSFK,nt,A,2,false,"Arg/N-end rule seed, prt6 vs. Wt",99,29168982,"MASCOT Score",36.0800000,,,,,0.0036750000435859,-2.8810377
ALPNQQTVDY,nt,A,2,false,"N-term acetylation drought responses",5,26184543,,,,,,,,
ALPNQQTVDYPSFKLVIVGDGGTGKTTFVKR,nta,A,2,false,"Arg/N-end rule pathway Roots",80,25728785,"MASCOT Score",22.8200000,,,,,0.08720999956131,
ALPNQQTVDYPSFKLVIVGDGGTGKTTF,nta,A,2,false,"Arg/N-end rule pathway Roots",80,25728785,"MASCOT Score",33.3400000,,,,,0.00042029999895021,
ALPNQQTVDYPSFKLVIVGDGGTGKTTF,nta,A,2,false,"Arabidopsis translation initiation landscape - NTA",167a,35069635,,,,,,,,
ALPNQQTVDYPSFKL,nta,A,2,false,"Arg/N-end rule seed, prt6 vs. Wt",99,29168982,"MASCOT Score",54.5300000,,-0.1670374,0.4963953,NO,0.015639999881387,-2.0931573
ALPNQQTVDYPSFK,nta,A,2,false,"Arg/N-end rule pathway Roots",80,25728785,"MASCOT Score",43.9600000,,,,,0.0059710000641644,
ALPNQQTVDYPSFK,nta,A,2,false,"Arg/N-end rule seed, prt6 vs. Wt",99,29168982,"MASCOT Score",36.0800000,,-0.0465775,0.8183826,NO,0.0036750000435859,-2.8810377
ALPNQQTVDY,nta,A,2,false,"N-term acetylation drought responses",5,26184543,,,,,,,,
ALPNQQTVDYPSFK,ph,T,8,false,"Lateral root-induction - NAA vs control",106,23328941,"MASCOT Score",23.0000000,,,,,,
LVIVGDGGTGKTTFVK,ac,K,26,false,"Quantitative Acetylproteomics",101,29440448,,,,,,,,
HLTGEFEK,ph,T,35,false,"Tissue atlas Arabidopsis - ProteomicsDB",114,32188942,"MaxQuant score",135.8600000,1.0000000,,,,0.0071029597893357,
HLTGEFEKK,ub,K,40,false,"upl3 mutant / wildtype",168,35926874,"MaxQuant score",80.6880000,1.0000000,0.5160151,0.3700800,NO,0.0044164801947773,-1.0311000
KYEPTIGVEVHPLDFFTNCGK,ox,C,59,false,"OxiTRAQ SA and flg22 responses - SA vs mock",91a,25720653,"MASCOT Score",60.7400000,,1.4276062,0.0260000,YES,,
KYEPTIGVEVHPLDFFTNCGK,ox,C,59,false,"OxiTRAQ SA and flg22 responses - flg22 vs mock",91b,25720653,"MASCOT Score",60.7400000,,0.8155754,0.2040000,NO,,
KYEPTIGVEVHPLDFFTNCGK,ox,C,59,false,"SPEAR - 10 mM H2O2 / mock",138a,34619326,,,,1.3178617,0.0256349,YES,,
KYEPTIGVEVHPLDFFTNCGK,sno,C,59,false,"Site-specific nitrosomeproteomic id - gsnor1-3",90a,25699590,XCorr,2.9700000,,,,,0.12749999761581,-4.6000000
KYEPTIGVEVHPLDFFTNCGK,sno,C,59,false,"Site-specific nitrosomeproteomic id - gsnor1-3",90b,25699590,XCorr,4.9600000,,,,,0.0079420004040003,-4.2100000
YEPTIGVEVHPLDFFTNCGK,sno,C,59,false,"hot5-4 / wildtype, FAT-switch S-nitrosoproteome",169,37277371,,,,1.3624900,0.0000083,YES,,
KYEPTIGVEVHPLDFFTNCGK,so,C,59,false,"S-sulfenylation site detection using YAP1C",110,32714340,,,,,,,,
FYCWDTAGQEK,sno,C,66,false,"Site-specific nitrosomeproteomic id - gsnor1-3",90a,25699590,XCorr,2.6574063,,,,,7.0139998570085E-5,-6.0841890
FYCWDTAGQEK,sno,C,66,false,"Site-specific nitrosomeproteomic id - gsnor1-3",90b,25699590,XCorr,3.1500000,,,,,0.013939999975264,-6.4200000
FYCWDTAGQEK,sno,C,66,false,"hot5-4 / wildtype, FAT-switch S-nitrosoproteome",169,37277371,,,,1.1066023,0.0002769,YES,,
IRFYCWDTAGQEK,so,C,66,false,"S-sulfenylation site detection using YAP1C",110,32714340,,,,,,,,
FYCWDTAGQEKFGGLR,ac,K,74,false,"Histone deacetylases substrates - hda14 vs WT",98e,29061669,"MaxQuant Score",41.5000000,1.0000000,-0.1230000,0.9120108,NO,0.003000000026077,
FYCWDTAGQEKFGGLR,ub,K,74,false,"upl3 mutant / wildtype",168,35926874,"MaxQuant score",154.6500000,1.0000000,-0.3883555,0.2852200,NO,1.7816799385479E-16,-1.2891000
DGYYIHGQCAIIMFDVTAR,so,C,88,false,"S-sulfenylation site detection using YAP1C",110,32714340,,,,,,,,
LTYKNVPTWHR,ac,K,102,false,"Quantitative Acetylproteomics",101,29440448,,,,,,,,
LTYKNVPTWHR,ub,K,102,false,"upl3 mutant / wildtype",168,35926874,"MaxQuant score",99.5000000,1.0000000,-0.0144996,0.9853200,NO,0.00013545999536291,-1.0390000
VCENIPIVLCGNK,sno,C,115,false,"Site-specific nitrosomeproteomic id - gsnor1-3",90a,25699590,XCorr,3.3416226,,,,,8.1719997979235E-5,-5.3801175
VCENIPIVLCGNK,so,C,115,false,"Arabidopsis S-sulfenylation chemoproteomics",108,31578252,"pFind PSM Score",0.0014247,,1.0608400,,,,-0.8226698
VCENIPIVLCGNK,so,C,115,false,"S-sulfenylation site detection using YAP1C",110,32714340,,,,,,,,
VCENIPIVLCGNK,acy,C,123,false,"Arabidopsis S-acylation atlas - Meristem",163a,35681017,,,,,,,,
VCENIPIVLCGNK,acy,C,123,false,"Arabidopsis S-acylation atlas - Hypocotyl",163b,35681017,,,,,,,,
VCENIPIVLCGNK,sno,C,123,false,"hot5-4 / wildtype, FAT-switch S-nitrosoproteome",169,37277371,,,,0.6428919,0.0006085,YES,,
VCENIPIVLCGNKVDVK,so,C,123,false,"S-sulfenylation site detection using YAP1C",110,32714340,,,,,,,,
NIPIVLCGNK,so,C,123,false,"S-sulfenylation site detection using YAP1C",110,32714340,,,,,,,,
GNKVDVKNRQVKAKQVTF,nt,G,124,false,"Arabidopsis translation initiation landscape - NT",167b,35069635,,,,,,,,
KKNLQYYEISAK,ac,K,145,false,"Quantitative Acetylproteomics",101,29440448,,,,,,,,
