Peptide,PTM,ModifiedAA,ModifiedPosition,PeptideUniqueToGene,ExperimentDesc,ExpID,PubmedID,ScoreType,IdentScore,LocProb,Log2FChange,PQ-val,QuantSig,PEP,MassErrorPPM
HLLSSPPPPR,ph,S,46,true,"Tissue atlas Arabidopsis - ProteomicsDB",114,32188942,"MaxQuant score",127.4200000,0.8158410,,,,6.3842999225017E-5,
HSLPLNDHASFIKR,ph,S,290,true,"Tissue atlas Arabidopsis - ProteomicsDB",114,32188942,"MaxQuant score",109.3800000,1.0000000,,,,2.6371699277661E-5,
RNPSVSAVNVVEK,ph,S,297,true,"Tissue atlas Arabidopsis - ProteomicsDB",114,32188942,"MaxQuant score",65.2980000,0.9622460,,,,0.0009557920275256,
NPQLGILTGKPMDETSQTLGNDVSYPSSKSPDLAK,ph,S,508,true,"Tissue atlas Arabidopsis - ProteomicsDB",114,32188942,"MaxQuant score",351.3500000,0.9266580,,,,0,
STGQSLSGSTAASEADSSEAGLSK,ph,S,520,true,"Tissue atlas Arabidopsis - ProteomicsDB",114,32188942,"MaxQuant score",160.8800000,0.9823910,,,,0,
SISVEPLDSGISGLGAK,ph,S,573,true,"Phospho cell culture sucrose/TOR",109,30833711,,,0.9390130,,,,,
SISVEPLDSGISGLGAK,ph,S,573,true,"Tissue atlas Arabidopsis - ProteomicsDB",114,32188942,"MaxQuant score",145.7900000,0.9999020,,,,3.0761699611193E-12,
SSDRHELYDSSDNEGEHR,ph,S,710,true,"Phospho cell culture sucrose/TOR",109,30833711,,,1.0000000,,,,,
HEDSSDVEHGHR,ph,S,771,true,"TOR Kinase and ABA Receptor",100,29290610,XCorr,3.3404741,0.9101000,,,,0.0010880000190809,
TVEEETVSKSDQSDLK,ph,S,800,true,"Tissue atlas Arabidopsis - ProteomicsDB",114,32188942,"MaxQuant score",124.4300000,0.9061050,,,,3.1586100007503E-15,
TVEEETVSKSDQSDLK,ph,S,803,true,"Tissue atlas Arabidopsis - ProteomicsDB",114,32188942,"MaxQuant score",124.4300000,0.9999480,,,,3.1586100007503E-15,
SDQSDLKASPGDNIPYLQNEPSQVSDELR,ph,S,808,true,"Tissue atlas Arabidopsis - ProteomicsDB",114,32188942,"MaxQuant score",140.4000000,0.9970980,,,,0,
