Peptide,PTM,ModifiedAA,ModifiedPosition,PeptideUniqueToGene,ExperimentDesc,ExpID,PubmedID,ScoreType,IdentScore,LocProb,Log2FChange,PQ-val,QuantSig,PEP,MassErrorPPM
GRPSKADLAAR,ac,K,15,true,"Quantitative Acetylproteomics",101,29440448,,,,,,,,
ADPPVKSR,ac,K,89,true,"Quantitative Acetylproteomics",101,29440448,,,,,,,,
HASDYEEEDEEDDEAEEEEEEVSEKR,ph,S,98,true,"Col-0 callus - FC Col-0 vs. Col-0 Xray",111a,31410901,,84.8400000,,-0.0634337,0.0000000,NO,,1.7678477
HASDYEEEDEEDDEAEEEEEEVSEKR,ph,S,98,true,"Col-0 X-ray callus - FC Col-0 vs. Col-0 Xray",111b,31410901,,84.8400000,,-0.0634337,0.0000000,NO,,1.7678477
HASDYEEEDEEDDEAEEEEEEVSEKR,ph,S,98,true,"atm callus - FC atm vs. atm Xray",111c,31410901,,84.8400000,,0.6817815,0.0000000,NO,,1.7678477
HASDYEEEDEEDDEAEEEEEEVSEKR,ph,S,98,true,"atm-3 X-ray callus - FC atm vs. atm Xray",111d,31410901,,84.8400000,,0.6817815,0.0000000,NO,,1.7678477
HASDYEEEDEEDDEAEEEEEEVSEK,ph,Y,100,true,"TOR Kinase and ABA Receptor",100,29290610,XCorr,5.8512745,0.9051000,,,,2.6509999528912E-8,
DYDVEEEEEEEEGHADSEEEDDK,ph,S,158,true,"TOR Kinase and ABA Receptor",100,29290610,XCorr,4.3167615,1.0000000,,,,5.8310001804784E-6,
SASGNQCDHSSETTPILDKK,ph,S,172,true,"Tissue atlas Arabidopsis - ProteomicsDB",114,32188942,"MaxQuant score",70.7180000,0.9847190,,,,3.0548999347957E-5,
AEDLSSGKGLFGK,ph,S,380,true,"Tissue atlas Arabidopsis - ProteomicsDB",114,32188942,"MaxQuant score",103.7700000,1.0000000,,,,4.825450014323E-5,
AEDLSSGKGLFGK,ph,S,381,true,"Tissue atlas Arabidopsis - ProteomicsDB",114,32188942,"MaxQuant score",103.7700000,1.0000000,,,,4.825450014323E-5,
KLSVVEEDRR,ph,S,394,true,"Tissue atlas Arabidopsis - ProteomicsDB",114,32188942,"MaxQuant score",66.5090000,1.0000000,,,,0.0029133600182831,
SNAATKTNETLFK,ac,K,515,true,"Quantitative Acetylproteomics",101,29440448,,,,,,,,
TNETLFKTPLPAK,ph,T,523,true,"Tissue atlas Arabidopsis - ProteomicsDB",114,32188942,"MaxQuant score",73.1380000,0.9967900,,,,0.00078845099778846,
ISSPQSAR,ph,S,736,true,"atm and atr DNA damage response",88,25561503,"MASCOT Score",38.0000000,1.0000000,,,,,-0.0600000
SEDSGNASVAAAR,ph,S,742,true,"Tissue atlas Arabidopsis - ProteomicsDB",114,32188942,"MaxQuant score",118.2400000,0.9999630,,,,2.5128699689958E-6,
SEDSGNASVAAAR,ph,S,745,true,"Tissue atlas Arabidopsis - ProteomicsDB",114,32188942,"MaxQuant score",93.8590000,0.9625800,,,,0.00033096098923124,
AWMSIGAGGNNKQTFENASNPK,fuc,S,773,true,"SPINDLY O-fucosylation",162,36739885,,,,,,,-0.9200000166893,
QTFENASNPK,fuc,S,773,true,"SPINDLY O-fucosylation",162,36739885,,,,,,,-0.75999999046326,
SSQISAESLYNPSR,og,S,778,true,"O-GlcNac Inflorescence Tissue",81,28154133,"MASCOT Score",22.3000000,,,,,,3.5000000
FHVQSQWRGGITPQVQLK,me1,R,864,true,"Arabidopsis protein methylome",123,31809900,"MaxQuant Score",48.2160000,1.0000000,,,,0.00067505397601053,-0.2802600
QENFNLPPDLNIGVHSPDSPAK,ph,S,892,true,"Tissue atlas Arabidopsis - ProteomicsDB",114,32188942,"MaxQuant score",87.5320000,0.9560700,,,,5.5793401010362E-9,
QRQENFNLPPDLNIGVHSPDSPAK,ph,S,895,true,"Tissue atlas Arabidopsis - ProteomicsDB",114,32188942,"MaxQuant score",201.6300000,0.9978110,,,,0,
