Peptide,PTM,ModifiedAA,ModifiedPosition,PeptideUniqueToGene,ExperimentDesc,ExpID,PubmedID,ScoreType,IdentScore,LocProb,Log2FChange,PQ-val,QuantSig,PEP,MassErrorPPM
VKIKKTKGMRKQIRLNE,nt,V,2,true,"Arabidopsis translation initiation landscape - NT",167b,35069635,,,,,,,,
INLHRPFGSR,ph,S,603,true,"Tissue atlas Arabidopsis - ProteomicsDB",114,32188942,"MaxQuant score",49.3330000,1.0000000,,,,0.0094271600246429,
RGAMEDEEEEEEEDHDGSGSSDDETGR,ph,S,691,true,"TOR Kinase and ABA Receptor",100,29290610,XCorr,6.3232226,0.9934000,,,,3.0520001018886E-5,
RGAMEDEEEEEEEDHDGSGSSDDETGR,ph,S,693,true,"TOR Kinase and ABA Receptor",100,29290610,XCorr,6.3232226,0.9934000,,,,3.0520001018886E-5,
RGAMEDEEEEEEEDHDGSGSSDDETGR,ph,S,694,true,"TOR Kinase and ABA Receptor",100,29290610,XCorr,6.3232226,0.9675000,,,,3.0520001018886E-5,
KIVSDNEENGGK,ph,S,710,true,"SnRK2 protein kinase substrates",85,23776212,XCorr,4.0488133,1.0000000,,,,0.00013700500130653,
KIVSDNEENGGK,ph,S,710,true,"TOR Kinase and ABA Receptor",100,29290610,XCorr,3.0873253,1.0000000,,,,0.1055999994278,
KIVSDNEENGGK,ph,S,710,true,"Tissue atlas Arabidopsis - ProteomicsDB",114,32188942,"MaxQuant score",182.4100000,1.0000000,,,,6.734910159E-15,
IVSDNEENGGK,ph,S,710,true,"SnRK2 protein kinase substrates",85,23776212,XCorr,2.7542727,1.0000000,,,,0.0033877301029861,
IVSDNEENGGK,ph,S,710,true,"atm and atr DNA damage response",88,25561503,"MASCOT Score",59.0000000,1.0000000,,,,,-0.2900000
