Peptide,PTM,ModifiedAA,ModifiedPosition,PeptideUniqueToGene,ExperimentDesc,ExpID,PubmedID,ScoreType,IdentScore,LocProb,Log2FChange,PQ-val,QuantSig,PEP,MassErrorPPM
APVGPRSGDAIFSSIDRVNAE,nt,A,2,true,"Arabidopsis translation initiation landscape - NT",167b,35069635,,,,,,,,
APVGPRSGD,nt,A,2,true,"Arg/N-end rule seed, prt6 vs. Wt",99,29168982,"MASCOT Score",20.0200000,,-0.1280663,0.2897176,NO,0.028939999639988,-0.2223956
SGDAIFSSIDR,ph,S,8,true,"Tissue atlas Arabidopsis - ProteomicsDB",114,32188942,"MaxQuant score",98.9020000,1.0000000,,,,9.2688002041541E-5,
SGDAIFSSIDR,ph,S,15,true,"Tissue atlas Arabidopsis - ProteomicsDB",114,32188942,"MaxQuant score",146.7900000,0.9616890,,,,3.2530500959638E-8,
TYGAIVRQLLTDLEEVEEVNK,nta,T,27,true,"Characterization plant N-terminal acetylation",6,22223895,"MASCOT Score",53.3800000,,,,,,
CVDFKETAEMIAK,acy,C,73,true,"Arabidopsis S-acylation atlas - Meristem",163a,35681017,,,,,,,,
CVDFKETAEMIAK,acy,C,73,true,"Arabidopsis S-acylation atlas - Hypocotyl",163b,35681017,,,,,,,,
CVDFKETAEMIAK,acy,C,73,true,"Arabidopsis S-acylation atlas - Leaf",163c,35681017,,,,,,,,
CVDFKETAEMIAK,acy,C,73,true,"Arabidopsis S-acylation atlas - Seedling",163d,35681017,,,,,,,,
CVDFKETAEMIAK,acy,C,73,true,"Arabidopsis S-acylation atlas - Silique",163e,35681017,,,,,,,,
CVDFKETAEMIAK,acy,C,73,true,"Arabidopsis S-acylation atlas - Stem",163f,35681017,,,,,,,,
LLKQVAEEYPYKDDE,ub,K,174,true,"upl3 mutant / wildtype",168,35926874,"MaxQuant score",147.5600000,1.0000000,0.7458827,0.4430200,NO,1.4235100186284E-14,-0.2847700
QVAEEYPYKDDE,ub,K,183,true,"upl3 mutant / wildtype",168,35926874,"MaxQuant score",56.2050000,1.0000000,0.6424705,,,0.0075740199536085,-1.4141000
