Peptide,PTM,ModifiedAA,ModifiedPosition,PeptideUniqueToGene,ExperimentDesc,ExpID,PubmedID,ScoreType,IdentScore,LocProb,Log2FChange,PQ-val,QuantSig,PEP,MassErrorPPM
MNEKANVSKELNAR,nta,M,1,true,"Arg/N-end rule pathway Roots",80,25728785,"MASCOT Score",43.1700000,,,,,0.00074869999662042,
MNEKANVSKELNAR,nta,M,1,true,"Arabidopsis translation initiation landscape - NTA",167a,35069635,,,,,,,,
MNEKANVSKE,nta,M,1,true,"N-term acetylation drought responses",5,26184543,,,,,,,,
SLGVHISKVR,nt,S,60,true,"Arabidopsis translation initiation landscape - NT",167b,35069635,,,,,,,,
AKYEEKR,ub,K,120,true,"Arabidopsis ubiquitination COFRADIC",40,26744219,"MaxQuant Score",57.2810000,1.0000000,,,,0.028000000864267,-3.0380000
ARSPPRVEQER,ph,S,131,true,"srk2dei ABA signaling phopshoproteomics",83,23572148,"MASCOT Score",22.0000000,,,,,,0.0000000
ARSPPRVEQER,ph,S,131,true,"TOR Kinase and ABA Receptor",100,29290610,XCorr,2.5812628,1.0000000,,,,0.0011520000407472,
ARSPPRVEQER,ph,S,131,true,"Phospho cell culture sucrose/TOR",109,30833711,,,1.0000000,,,,,
SPPRVEQER,ph,S,131,true,"Tissue atlas Arabidopsis - ProteomicsDB",114,32188942,"MaxQuant score",176.2500000,1.0000000,,,,9.5276304207248E-13,
SGPGYEHGHSSSPVNLFEER,ph,S,146,true,"Tissue atlas Arabidopsis - ProteomicsDB",114,32188942,"MaxQuant score",109.2800000,0.9999960,,,,3.8121801722302E-12,
SGPGYEHGHSSSPVNLFEERK,ph,Y,150,true,"TOR Kinase and ABA Receptor",100,29290610,XCorr,2.1951070,0.7664000,,,,0.0012550000101328,
SGPGYEHGHSSSPVNLFEER,ph,S,155,true,"Tissue atlas Arabidopsis - ProteomicsDB",114,32188942,"MaxQuant score",103.9600000,0.9845720,,,,5.9397899931923E-9,
SGPGYEHGHSSSPVNLFEER,ph,S,157,true,"SnRK2 protein kinase substrates",85,23776212,XCorr,2.8860497,0.9530000,,,,0.00014452899631578,
SGPGYEHGHSSSPVNLFEER,ph,S,157,true,"Tissue atlas Arabidopsis - ProteomicsDB",114,32188942,"MaxQuant score",282.2200000,0.9727860,,,,0,
INLPVPPQGPSQVIKPQQK,ph,S,192,true,"Tissue atlas Arabidopsis - ProteomicsDB",114,32188942,"MaxQuant score",86.5570000,1.0000000,,,,6.5377498685848E-6,
MESAATPVEREK,mox,M,201,true,"cat2 Methionine oxidation - 3h stress",62b,25693801,"MASCOT Score",42.0000000,,0.0513366,,NO,,
MESAATPVER,ph,T,206,true,"TOR Kinase and ABA Receptor",100,29290610,XCorr,2.5343432,1.0000000,,,,0.0018489999929443,
MESAATPVER,ph,T,206,true,"Lateral root-induction - NAA vs control",106,23328941,"MASCOT Score",54.0000000,,0.2694857,0.3032207,NO,,
MESAATPVER,ph,T,206,true,"Tissue atlas Arabidopsis - ProteomicsDB",114,32188942,"MaxQuant score",171.3200000,1.0000000,,,,1.305230057369E-7,
SMDDSTTNTSE,nt,S,237,true,"Arg/N-end rule seed, prt6 vs. Wt",99,29168982,"MASCOT Score",32.1400000,,0.0853251,0.9194229,NO,0.049460001289845,-1.5893868
IVTAKPAESSSPPASSSDFEDLFK,ph,S,284,true,"Large-scale phosphorylation discovery",44,23111157,XCorr,3.7240000,,,,,,
PAESSSPPASSSDFEDLFK,ph,S,284,true,"atm and atr DNA damage response",88,25561503,"MASCOT Score",41.0000000,0.9140000,,,,,0.0600000
IVTAKPAESSSPPASSSDFEDLFK,ph,S,285,true,"Col-0 callus - FC Col-0 vs. Col-0 Xray",111a,31410901,,35.7100000,,0.4165796,0.0000000,NO,,0.8953428
IVTAKPAESSSPPASSSDFEDLFK,ph,S,285,true,"Col-0 X-ray callus - FC Col-0 vs. Col-0 Xray",111b,31410901,,35.7100000,,0.4165796,0.0000000,NO,,0.8953428
IVTAKPAESSSPPASSSDFEDLFK,ph,S,285,true,"atm callus - FC atm vs. atm Xray",111c,31410901,,35.7100000,,0.4434622,0.0000000,NO,,0.8953428
IVTAKPAESSSPPASSSDFEDLFK,ph,S,285,true,"atm-3 X-ray callus - FC atm vs. atm Xray",111d,31410901,,35.7100000,,0.4434622,0.0000000,NO,,0.8953428
IVTAKPAESSSPPASSSDFEDLFK,ph,S,285,true,"Tissue atlas Arabidopsis - ProteomicsDB",114,32188942,"MaxQuant score",305.6300000,0.9974070,,,,0,
DFDFSSLMDGMFTKH,nt,D,469,true,"Metacaspase9 substrates - Col-0 / mc9",51a,23964026,"MASCOT Score",78.0000000,,,,,,-2.2485075
